{"text_format":"1","workbook":"xlsx","n_sheets":9,"sheets":["INSTRUCCIONES","INFORMACIÓN DE LA ORGANIZACIÓN","BD PLÁSTICOS","LB MENSUAL","ANÁLISIS CUANTITATIVO","INDICADORES","SEGUIMIENTO MENSUAL","BD SEGUIMIENTO MENSUAL","FICHAS TÉCNICAS DE PLÁSTICOS"],"not_rendered":{"charts":0,"images":6,"macros":1,"external_links":0,"defined_names":39,"comments":0,"pivot_tables":0},"unopened":[],"bounds":{"document_bytes":16777216,"sheet_cells":100000,"rows_first":2000,"rows_last":500,"rows_between":2000,"halvings":0,"cell_chars":16384,"cell_head_chars":4096},"cells_cut":0,"cells_raw":0,"read":"whole","date_system":"1900"}

{"sheet":"INSTRUCCIONES","index":0,"n_rows":80,"n_cols":8,"rows_kept":80,"cut":false,"hidden":false,"merged":[[72,1,72,11],[73,1,73,11],[54,1,54,11],[55,1,55,11],[56,1,56,11],[24,1,24,11],[25,1,25,11],[26,1,26,11],[40,1,40,11],[44,1,44,11],[45,1,45,11],[50,1,50,11],[52,1,52,11],[53,1,53,11],[30,1,30,11],[34,1,34,11],[35,1,35,11],[37,1,37,11],[58,1,58,11],[38,1,38,11],[39,1,39,11],[43,1,43,11],[49,1,49,11],[41,1,41,11],[22,1,22,11],[23,1,23,11],[3,1,3,11],[0,1,1,11],[5,1,5,11],[14,1,14,11],[7,1,7,4],[16,1,16,11],[17,1,17,11],[18,1,18,11],[7,7,7,10],[8,1,8,3],[9,1,9,3],[10,1,10,3],[9,7,9,9],[10,7,10,9],[8,7,8,9],[9,10,9,11],[10,10,10,11],[15,1,15,11],[12,1,12,11],[19,1,19,11],[20,1,20,11],[21,1,21,11],[42,1,42,11],[47,1,47,11],[33,1,33,11],[36,1,36,11],[46,1,46,11],[48,1,48,11],[27,1,27,11],[28,1,28,11],[29,1,29,11],[84,1,84,11],[85,1,85,11],[86,1,86,11],[87,1,87,11],[80,1,80,11],[81,1,81,11],[82,1,82,11],[79,1,79,11],[59,1,59,11],[78,1,78,11],[75,1,75,11],[60,1,60,11],[83,1,83,11],[76,1,76,11],[66,1,66,11],[61,1,61,11],[62,1,62,11],[63,1,63,11],[64,1,64,11],[65,1,65,11],[68,1,68,11],[69,1,69,11],[70,1,70,11],[71,1,71,11],[93,1,93,11],[94,1,94,11],[95,1,95,11],[96,1,96,11],[97,1,97,11],[88,1,88,11],[89,1,89,11],[90,1,90,11],[91,1,91,11],[92,1,92,11],[103,1,103,11],[104,1,104,11],[105,1,105,11],[106,1,106,11],[107,1,107,11],[98,1,98,11],[99,1,99,11],[100,1,100,11],[101,1,101,11],[102,1,102,11],[113,1,113,11],[114,1,114,11],[115,1,115,11],[116,1,116,11],[117,1,117,11],[108,1,108,11],[109,1,109,11],[110,1,110,11],[111,1,111,11],[112,1,112,11],[123,1,123,11],[124,1,124,11],[125,1,125,11],[126,1,126,11],[127,1,127,11],[118,1,118,11],[119,1,119,11],[120,1,120,11],[121,1,121,11],[122,1,122,11],[133,1,133,11],[134,1,134,11],[135,1,135,11],[136,1,136,11],[137,1,137,11],[128,1,128,11],[129,1,129,11],[130,1,130,11],[131,1,131,11],[132,1,132,11],[143,1,143,11],[144,1,144,11],[145,1,145,11],[146,1,146,11],[147,1,147,11],[138,1,138,11],[139,1,139,11],[140,1,140,11],[141,1,141,11],[142,1,142,11],[153,1,153,11],[154,1,154,11],[155,1,155,11],[156,1,156,11],[157,1,157,11],[148,1,148,11],[149,1,149,11],[150,1,150,11],[151,1,151,11],[152,1,152,11],[163,1,163,11],[164,1,164,11],[165,1,165,11],[166,1,166,11],[167,1,167,11],[158,1,158,11],[159,1,159,11],[160,1,160,11],[161,1,161,11],[162,1,162,11],[173,1,173,11],[174,1,174,11],[175,1,175,11],[176,1,176,11],[177,1,177,11],[168,1,168,11],[169,1,169,11],[170,1,170,11],[171,1,171,11],[172,1,172,11],[183,1,183,11],[184,1,184,11],[185,1,185,11],[186,1,186,11],[187,1,187,11],[178,1,178,11],[179,1,179,11],[180,1,180,11],[181,1,181,11],[182,1,182,11],[193,1,193,11],[194,1,194,11],[195,1,195,11],[196,1,196,11],[197,1,197,11],[188,1,188,11],[189,1,189,11],[190,1,190,11],[191,1,191,11],[192,1,192,11],[203,1,203,11],[204,1,204,11],[205,1,205,11],[206,1,206,11],[207,1,207,11],[198,1,198,11],[199,1,199,11],[200,1,200,11],[201,1,201,11],[202,1,202,11],[213,1,213,11],[214,1,214,11],[215,1,215,11],[216,1,216,11],[217,1,217,11],[208,1,208,11],[209,1,209,11],[210,1,210,11],[211,1,211,11],[212,1,212,11],[223,1,223,11],[224,1,224,11],[225,1,225,11],[226,1,226,11],[227,1,227,11],[218,1,218,11],[219,1,219,11],[220,1,220,11],[221,1,221,11],[222,1,222,11],[259,1,259,11],[260,1,260,11],[261,1,261,11],[31,1,31,11],[253,1,253,11],[254,1,254,11],[255,1,255,11],[256,1,256,11],[257,1,257,11],[248,1,248,11],[249,1,249,11],[250,1,250,11],[251,1,251,11],[258,1,258,11],[252,1,252,11],[243,1,243,11],[244,1,244,11],[245,1,245,11],[246,1,246,11],[228,1,228,11],[229,1,229,11],[230,1,230,11],[231,1,231,11],[232,1,232,11],[247,1,247,11],[238,1,238,11],[239,1,239,11],[240,1,240,11],[241,1,241,11],[242,1,242,11],[233,1,233,11],[234,1,234,11],[235,1,235,11],[236,1,236,11],[237,1,237,11]]}
[null,"GUÍA MENOS PLÁSTICO\nHerramientas para prevenir el consumo de plásticos en el sector turismo"]
[]
[]
[null,"\nEsta herramienta es el resultado de los trabajos de actualización realizados en la “Herramienta para la identificación de plásticos innecesarios en el sector del turismo” del proyecto OLAS. El proyecto OLAS fue el resultado de la alianza estratégica entre la empresa LafargeHolcim y la Deutsche Gesellschaft für Internationale Zusammenarbeit (GIZ) GmbH, esta última, trabajando por encargo del Ministerio Federal de Cooperación Económica y Desarrollo (BMZ) de Alemania.\n\nLos trabajos de actualización, se realizaron en el marco del proyecto  “Prevención de residuos plásticos en los mares de Centroamérica y el Caribe (Caribe Circular)” que es implementado por la Deutsche Gesellschaft für Internationale Zusammenarbeit (GIZ) GmbH, en coordinación con la Comisión Centroamericana de Ambiente y Desarrollo (CCAD) del Sistema de la Integración Centroamericana (SICA) y con la Secretaría de Ecología y Medio Ambiente (SEMA) del Estado de Quintana-Roo, México. Está financiado por la Unión Europea (UE) y el Ministerio Federal de Cooperación Económica y Desarrollo (BMZ) de Alemania.\n\nA través de su uso, se espera contribuir con el sector del turismo de Centroamérica y México para disminuir el consumo de productos de plástico que tienen el potencial de convertirse en contaminación marina."]
[]
[null,"INSTRUCCIONES"]
[]
[null,"CódiGo de colores de las hojas",null,null,null,null,null,"Código de color de las celdas"]
[null,"Las HOJAS GRISES contienen información general sobre la herramienta así como información de apoyo y consulta para el usuario.",null,null,null,null,null,"Las celdas grises muestran los encabezados de cada hoja."]
[null,"Las HOJAS de color VERDE contienen apartados donde el usuario deberá ingresar información.",null,null,null,null,null,"Las celdas de color verde claro señalan las columnas o celdas donde se deberá realizar  el registro de información por parte del usuario."]
[null,"Las HOJAS de color AZUL permiten la visualización de la información que se genera a partir del ingreso de Datos por parte del usuario.",null,null,null,null,null,"Las celdas de color azul claro señalan las columnas o celdas donde se despliega la información del análisis que realiza la herramienta."]
[]
[null,"Cuando tengas dudas sobre el significado de una instrucción, concepto o botón, puedes dar un clic sobre el elemento de la herramienta que genera la duda y te enviará a un apartado dentro de esta hoja para proporcionate información sobre ese elemento."]
[]
[null,"INFORMACIÓN DE LA ORGANIZACIÓN"]
{"$rows_left_out":66}
{"sheet":"INFORMACIÓN DE LA ORGANIZACIÓN","index":1,"n_rows":23,"n_cols":8,"rows_kept":23,"cut":false,"hidden":false,"merged":[[8,1,8,2],[0,2,0,8],[2,1,2,4],[1,1,1,8],[2,7,2,8],[2,5,2,6]]}
[]
[null,"INFORMACIÓN DE LA ORGANIZACIÓN"]
[null,"ORGANIZACIÓN",null,null,null,"UBICACIÓN",null,"SUSTENTABILIDAD"]
[null,"Nombre ",null,"Año del registro de Línea Base",null,"País de origen",null,"Certificaciones con las que cuenta "]
[null,"Giro comercial ",null,"Duración media de la estancia (Hoteles)",null,"Municipalidad",null,"¿Cuenta con algún documento que contenga la política de sustentabilidad?"]
[null,"No. de habitaciones/mesas/unidades/otro",null,"Servicios que ofrece",null,"Dirección completa"]
[null,"Promedio de huéspedes por habitación/clientes por mesa/otro",null,"No. de trabajadores",null,"Ubicación geográfica"]
[]
[null,"Porcentaje de operación mensual"]
[null,"MES","% OCUPACIÓN","% MENSUAL"]
[null,"Enero",1,{"$f":"(C11*100/C$23)/100","v":8.3333333333333343E-2}]
[null,"Febrero",1,{"$f":"(C12*100/C$23)/100","v":8.3333333333333343E-2}]
[null,"Marzo",1,8.3333333333333343E-2]
[null,"Abril",1,8.3333333333333343E-2]
[null,"Mayo",1,8.3333333333333343E-2]
{"$rows_left_out":9}
{"sheet":"BD PLÁSTICOS","index":2,"n_rows":2,"n_cols":19,"rows_kept":2,"cut":false,"hidden":false,"merged":[[0,0,0,11],[0,12,0,13]]}
["INFORMACIÓN DE LÍNEA BASE",null,null,null,null,null,null,null,null,null,null,null,"PLAN  DE ACCIÓN"]
["No. IDENTIFICADOR","ÁREA DEL HOTEL","PRODUCTO DE PLÁSTICO","TIPO DE EMPAQUE","CANTIDAD DE PRODUCTO POR EMPAQUE","CANTIDAD DE EMPAQUES ADQUIRIDOS","GASTO REALIZADO POR CADA DE EMPAQUE","TIPO DE MANEJO","CATEGORÍA DEL PRODUCTO","TIPO DE PRODUCTO","PESO DEL PRODUCTO DE PLÁSTICO","TIPO DE PLÁSTICO","OBJETIVO","PORCENTAJE","Columna2","Columna1","GASTO DE ADQUISICIÓN ANUAL ","PESO TOTAL ANUAL DEL PRODUCTO","UNIDADES AL AÑO DE PRODUCTO"]

{"sheet":"LB MENSUAL","index":3,"n_rows":22,"n_cols":13,"rows_kept":22,"cut":false,"hidden":false,"merged":[[0,0,0,11]]}
["INFORMACIÓN DE LÍNEA BASE MENSUAL (CANTIDAD DE EMPAQUES ADQUIRIDOS POR MES)"]
["No. IDENTIFICADOR","Enero","Febrero","Marzo","Abril","Mayo","Junio","Julio","Agosto","Septiembre","Octubre","Noviembre","Diciembre"]
[1090,1800,2250,4050,2250,2400,4200,2850,2550,2250,1950,3600,1500]
[30544,21,15,21,4,28,18,22,23,5,4,19,15]
[1742,16,6,26,14,13,14,14,18,6,8,17,14]
[1744,20,45,25,31,64,25,65,90,21,9,20,0]
[1667,14,12,14,20,39,33,28,20,21,26,28,26]
[1668,20,19,6,20,14,35,31,10,26,27,31,30]
[1669,18,17,17,16,45,33,32,14,28,27,31,30]
[35681,600,0,2100,1200,2400,0,0,2400,0,0,0,0]
[45554,1344,384,2688,576,1920,1152,0,2688,2688,768,4032,768]
[1655,54,66,89,95,62,93,87,87,90,89,105,93]
[56996,750,100,735,1100,565,150,400,750,525,500,425,725]
[56998,50,50,225,125,225,350,275,100,250,75,325,175]
[56999,75,425,150,25,275,575,475,225,175,200,250,200]
{"$rows_left_out":8}
{"sheet":"ANÁLISIS CUANTITATIVO","index":4,"n_rows":274,"n_cols":9,"rows_kept":274,"cut":false,"hidden":false,"merged":[[1,1,1,4],[3,1,3,4],[223,1,223,4],[241,1,241,4],[2,1,2,4],[237,1,237,4],[219,1,219,4]]}
[]
[null,"ANÁLISIS CUANTITAVIVO"]
[]
[null," INVENTARIO DE PRODUCTOS DE PLÁSTICO"]
[null,"PRODUCTO","UNIDADES DEL PRODUCTO AL AÑO","PESO ANUAL (kg)","GASTO DE ADQUISCIÓN  ANUAL",null,"UNIDADES Aux","PESO Aux","GASTO Aux"]
[null,{"$f":"_xlfn.UNIQUE(_xlfn._xlws.FILTER(BDP[TIPO DE PRODUCTO],BDP[TIPO DE PRODUCTO]<> \"\"))","v":{"$error":"#VALUE!"}},{"$f":"SUMIF('BD PLÁSTICOS'!J:J,'ANÁLISIS CUANTITATIVO'!B6,'BD PLÁSTICOS'!S:S)","v":0},{"$f":"SUMIF('BD PLÁSTICOS'!J:J,'ANÁLISIS CUANTITATIVO'!B6,'BD PLÁSTICOS'!R:R)","v":0},{"$f":"SUMIF('BD PLÁSTICOS'!J:J,'ANÁLISIS CUANTITATIVO'!B6,'BD PLÁSTICOS'!Q:Q)","v":0},null,{"$f":"C6+(COUNTA($C$6:$C$219)-ROW()+20)*0.00001","v":2.2800000000000003E-3},{"$f":"D6+(COUNTA($C$6:$C$219)-ROW()+20)*0.00001","v":2.2800000000000003E-3},{"$f":"E6+(COUNTA($C$6:$C$219)-ROW()+20)*0.00001","v":2.2800000000000003E-3}]
[null,null,{"$f":"SUMIF('BD PLÁSTICOS'!J:J,'ANÁLISIS CUANTITATIVO'!B7,'BD PLÁSTICOS'!S:S)","v":0},{"$f":"SUMIF('BD PLÁSTICOS'!J:J,'ANÁLISIS CUANTITATIVO'!B7,'BD PLÁSTICOS'!R:R)","v":0},{"$f":"SUMIF('BD PLÁSTICOS'!J:J,'ANÁLISIS CUANTITATIVO'!B7,'BD PLÁSTICOS'!Q:Q)","v":0},null,2.2700000000000003E-3,2.2700000000000003E-3,2.2700000000000003E-3]
[null,null,{"$f":"SUMIF('BD PLÁSTICOS'!J:J,'ANÁLISIS CUANTITATIVO'!B8,'BD PLÁSTICOS'!S:S)","v":0},{"$f":"SUMIF('BD PLÁSTICOS'!J:J,'ANÁLISIS CUANTITATIVO'!B8,'BD PLÁSTICOS'!R:R)","v":0},{"$f":"SUMIF('BD PLÁSTICOS'!J:J,'ANÁLISIS CUANTITATIVO'!B8,'BD PLÁSTICOS'!Q:Q)","v":0},null,2.2600000000000003E-3,2.2600000000000003E-3,2.2600000000000003E-3]
[null,null,{"$f":"SUMIF('BD PLÁSTICOS'!J:J,'ANÁLISIS CUANTITATIVO'!B9,'BD PLÁSTICOS'!S:S)","v":0},{"$f":"SUMIF('BD PLÁSTICOS'!J:J,'ANÁLISIS CUANTITATIVO'!B9,'BD PLÁSTICOS'!R:R)","v":0},{"$f":"SUMIF('BD PLÁSTICOS'!J:J,'ANÁLISIS CUANTITATIVO'!B9,'BD PLÁSTICOS'!Q:Q)","v":0},null,2.2500000000000003E-3,2.2500000000000003E-3,2.2500000000000003E-3]
[null,null,{"$f":"SUMIF('BD PLÁSTICOS'!J:J,'ANÁLISIS CUANTITATIVO'!B10,'BD PLÁSTICOS'!S:S)","v":0},{"$f":"SUMIF('BD PLÁSTICOS'!J:J,'ANÁLISIS CUANTITATIVO'!B10,'BD PLÁSTICOS'!R:R)","v":0},{"$f":"SUMIF('BD PLÁSTICOS'!J:J,'ANÁLISIS CUANTITATIVO'!B10,'BD PLÁSTICOS'!Q:Q)","v":0},null,2.2400000000000002E-3,2.2400000000000002E-3,2.2400000000000002E-3]
[null,null,{"$f":"SUMIF('BD PLÁSTICOS'!J:J,'ANÁLISIS CUANTITATIVO'!B11,'BD PLÁSTICOS'!S:S)","v":0},{"$f":"SUMIF('BD PLÁSTICOS'!J:J,'ANÁLISIS CUANTITATIVO'!B11,'BD PLÁSTICOS'!R:R)","v":0},{"$f":"SUMIF('BD PLÁSTICOS'!J:J,'ANÁLISIS CUANTITATIVO'!B11,'BD PLÁSTICOS'!Q:Q)","v":0},null,2.2300000000000002E-3,2.2300000000000002E-3,2.2300000000000002E-3]
[null,null,{"$f":"SUMIF('BD PLÁSTICOS'!J:J,'ANÁLISIS CUANTITATIVO'!B12,'BD PLÁSTICOS'!S:S)","v":0},{"$f":"SUMIF('BD PLÁSTICOS'!J:J,'ANÁLISIS CUANTITATIVO'!B12,'BD PLÁSTICOS'!R:R)","v":0},{"$f":"SUMIF('BD PLÁSTICOS'!J:J,'ANÁLISIS CUANTITATIVO'!B12,'BD PLÁSTICOS'!Q:Q)","v":0},null,2.2200000000000002E-3,2.2200000000000002E-3,2.2200000000000002E-3]
[null,null,{"$f":"SUMIF('BD PLÁSTICOS'!J:J,'ANÁLISIS CUANTITATIVO'!B13,'BD PLÁSTICOS'!S:S)","v":0},{"$f":"SUMIF('BD PLÁSTICOS'!J:J,'ANÁLISIS CUANTITATIVO'!B13,'BD PLÁSTICOS'!R:R)","v":0},{"$f":"SUMIF('BD PLÁSTICOS'!J:J,'ANÁLISIS CUANTITATIVO'!B13,'BD PLÁSTICOS'!Q:Q)","v":0},null,2.2100000000000002E-3,2.2100000000000002E-3,2.2100000000000002E-3]
[null,null,{"$f":"SUMIF('BD PLÁSTICOS'!J:J,'ANÁLISIS CUANTITATIVO'!B14,'BD PLÁSTICOS'!S:S)","v":0},{"$f":"SUMIF('BD PLÁSTICOS'!J:J,'ANÁLISIS CUANTITATIVO'!B14,'BD PLÁSTICOS'!R:R)","v":0},{"$f":"SUMIF('BD PLÁSTICOS'!J:J,'ANÁLISIS CUANTITATIVO'!B14,'BD PLÁSTICOS'!Q:Q)","v":0},null,2.2000000000000001E-3,2.2000000000000001E-3,2.2000000000000001E-3]
[null,null,{"$f":"SUMIF('BD PLÁSTICOS'!J:J,'ANÁLISIS CUANTITATIVO'!B15,'BD PLÁSTICOS'!S:S)","v":0},{"$f":"SUMIF('BD PLÁSTICOS'!J:J,'ANÁLISIS CUANTITATIVO'!B15,'BD PLÁSTICOS'!R:R)","v":0},{"$f":"SUMIF('BD PLÁSTICOS'!J:J,'ANÁLISIS CUANTITATIVO'!B15,'BD PLÁSTICOS'!Q:Q)","v":0},null,2.1900000000000001E-3,2.1900000000000001E-3,2.1900000000000001E-3]
{"$rows_left_out":260}
{"sheet":"INDICADORES","index":5,"n_rows":31,"n_cols":9,"rows_kept":31,"cut":false,"hidden":false,"merged":[[1,1,1,8],[4,1,4,2],[4,4,4,5],[4,7,4,8]]}
[]
[null,"INDICADORES"]
[]
[]
["Posición Ordinal","PRODUCTOS DE MAYOR IMPORTANCIA DE ACUERDO CON EL INDICADOR GASTO DE ADQUISICIÓN (GA)",null,null,"PRODUCTOS DE MAYOR IMPORTANCIA DE ACUERDO CON EL  INDICADOR PESO (kg)",null,null,"PRODUCTOS DE MAYOR IMPORTANCIA DE ACUERDO CON EL INDICADOR  CANTIDAD DE PRODUCTO (CP)"]
[null,"CaracterístIcas del producto","Indicador GA",null,"CaracterístIcas del producto","Indicador Peso",null,"CaracterístIcas del producto","Indicador CP"]
[]
[1,"Nombre",{"$f":"INDEX('ANÁLISIS CUANTITATIVO'!$B$6:$E$219,MATCH(C9,'ANÁLISIS CUANTITATIVO'!$I$6:$I$219,0),1)","v":{"$error":"#VALUE!"}},null,"Nombre",{"$f":"INDEX('ANÁLISIS CUANTITATIVO'!$B$6:$E$219,MATCH(F9,'ANÁLISIS CUANTITATIVO'!$H$6:$H$219,0),1)","v":{"$error":"#VALUE!"}},null,"Nombre",{"$f":"INDEX('ANÁLISIS CUANTITATIVO'!$B$6:$E$219,MATCH(I9,'ANÁLISIS CUANTITATIVO'!$G$6:$G$219,0),1)","v":{"$error":"#VALUE!"}}]
[null,"Gasto de adquisición mensual ",{"$f":"LARGE('ANÁLISIS CUANTITATIVO'!$I$6:$I$219,$A$8)","v":2.2800000000000003E-3},null,"Peso mensual (Kg)",{"$f":"LARGE('ANÁLISIS CUANTITATIVO'!$H$6:$H$219,$A$8)","v":2.2800000000000003E-3},null,"Unidades de producto mensuales",{"$f":"LARGE('ANÁLISIS CUANTITATIVO'!$G$6:$G$219,$A$8)","v":2.2800000000000003E-3}]
[null,"Peso mensual (kg)",{"$f":"INDEX('ANÁLISIS CUANTITATIVO'!$B$6:$E$219,MATCH(C8,'ANÁLISIS CUANTITATIVO'!$B$6:$B$219,0),3)","v":{"$error":"#VALUE!"}},null,"Gasto de adquisición mensual ",{"$f":"INDEX('ANÁLISIS CUANTITATIVO'!$B$6:$E$219,MATCH(F8,'ANÁLISIS CUANTITATIVO'!$B$6:$B$219,0),4)","v":{"$error":"#VALUE!"}},null,"Gasto de adquisición mensual ",{"$f":"INDEX('ANÁLISIS CUANTITATIVO'!$B$6:$E$219,MATCH(I8,'ANÁLISIS CUANTITATIVO'!$B$6:$B$219,0),4)","v":{"$error":"#VALUE!"}}]
[null,"Unidades de producto mensuales",{"$f":"INDEX('ANÁLISIS CUANTITATIVO'!$B$6:$E$219,MATCH(C8,'ANÁLISIS CUANTITATIVO'!$B$6:$B$219,0),2)","v":{"$error":"#VALUE!"}},null,"Unidades de producto mensuales",{"$f":"INDEX('ANÁLISIS CUANTITATIVO'!$B$6:$E$219,MATCH(F8,'ANÁLISIS CUANTITATIVO'!$B$6:$B$219,0),2)","v":{"$error":"#VALUE!"}},null,"Peso mensual (kg)",{"$f":"INDEX('ANÁLISIS CUANTITATIVO'!$B$6:$E$219,MATCH(I8,'ANÁLISIS CUANTITATIVO'!$B$6:$B$219,0),3)","v":{"$error":"#VALUE!"}}]
[]
[2,"Nombre",{"$f":"INDEX('ANÁLISIS CUANTITATIVO'!$B$6:$E$219,MATCH(C14,'ANÁLISIS CUANTITATIVO'!$I$6:$I$219,0),1)","v":0},null,"Nombre",{"$f":"INDEX('ANÁLISIS CUANTITATIVO'!$B$6:$E$219,MATCH(F14,'ANÁLISIS CUANTITATIVO'!$H$6:$H$219,0),1)","v":0},null,"Nombre",{"$f":"INDEX('ANÁLISIS CUANTITATIVO'!$B$6:$E$219,MATCH(I14,'ANÁLISIS CUANTITATIVO'!$G$6:$G$219,0),1)","v":0}]
[null,"Gasto de adquisición mensual ",{"$f":"LARGE('ANÁLISIS CUANTITATIVO'!$I$6:$I$219,$A$13)","v":2.2700000000000003E-3},null,"Peso mensual (Kg)",{"$f":"LARGE('ANÁLISIS CUANTITATIVO'!$H$6:$H$219,$A$13)","v":2.2700000000000003E-3},null,"Unidades de producto mensuales",{"$f":"LARGE('ANÁLISIS CUANTITATIVO'!$G$6:$G$219,$A$13)","v":2.2700000000000003E-3}]
[null,"Peso mensual (kg)",{"$f":"INDEX('ANÁLISIS CUANTITATIVO'!$B$6:$E$219,MATCH(C13,'ANÁLISIS CUANTITATIVO'!$B$6:$B$219,0),3)","v":{"$error":"#N/A"}},null,"Gasto de adquisición mensual ",{"$f":"INDEX('ANÁLISIS CUANTITATIVO'!$B$6:$E$219,MATCH(F13,'ANÁLISIS CUANTITATIVO'!$B$6:$B$219,0),4)","v":{"$error":"#N/A"}},null,"Gasto de adquisición mensual ",{"$f":"INDEX('ANÁLISIS CUANTITATIVO'!$B$6:$E$219,MATCH(I13,'ANÁLISIS CUANTITATIVO'!$B$6:$B$219,0),4)","v":{"$error":"#N/A"}}]
{"$rows_left_out":17}
{"sheet":"SEGUIMIENTO MENSUAL","index":6,"n_rows":22,"n_cols":47,"rows_kept":22,"cut":false,"hidden":false,"merged":[[0,4,0,8],[0,0,0,3],[0,9,0,10]]}
[]
["No. IDENTIFICADOR","ÁREA DEL HOTEL","PRODUCTO DE PLÁSTICO","TIPO DE EMPAQUE","CANTIDAD DE PRODUCTO POR EMPAQUE (Realiza cambios si es necesario)","CANTIDAD DE EMPAQUES ADQUIRIDOS (Registra los datos de seguimiento)","GASTO REALIZADO POR CADA DE EMPAQUE (Realiza cambios si es necesario)","TIPO DE MANEJO","CATEGORÍA DEL PRODUCTO","TIPO DE PRODUCTO","PESO DEL PRODUCTO DE PLÁSTICO","TIPO DE PLÁSTICO","Año de seguimiento","Mes de seguimiento","Abril","Mayo","Junio","Julio","Agosto","Septiembre","Octubre","Noviembre","Diciembre","Enero","Febrero","Marzo","Abril","Mayo","Junio","Julio","Agosto","Septiembre","Octubre","Noviembre","Diciembre","Enero","Febrero","Marzo","Abril","Mayo","Junio","Julio","Agosto","Septiembre","Octubre","Noviembre","Diciembre"]
[1090,"HABITACIONES","COFFE KIT REGULAR P/4 TAZAS C/CAFE/AZUC","PIEZA",1,0,9.91,"DISPONE","Kit_de_café","COFFE KIT REGULAR P/4 TAZAS C/CAFE/AZUC",1E-3,0,2023]
[30544,"HABITACIONES","CAFE DECAF PQT/C/50 PZA 2 GR","FRASCO C/50",50,0,66.540000000000006,"DISPONE","Kit_de_café","CAFE DECAF PQT/C/50 PZA 2 GR",1E-3,0]
[1742,"HABITACIONES","89330 - PAÑUELOS FACIALES KLEENEX BLAN","CAJA C/72",72,0,809,"DISPONE","Amenidades_de_baño","89330 - PAÑUELOS FACIALES KLEENEX BLAN",2E-3,0]
[1744,"HABITACIONES","90498 - HIGIENICO TRAD KLEENEX COTONELL","PAQUETE C/72",72,0,605.12,"DISPONE","Amenidades_de_baño","90498 - HIGIENICO TRAD KLEENEX COTONELL",0.05,0]
[1667,"HABITACIONES","B9500BL040S CREMA CORPORAL DREAMS G&S 1","BOTE C/100",100,0,955,"DISPONE","Amenidades_de_baño","B9500BL040S CREMA CORPORAL DREAMS G&S 1",0.03,0]
[1668,"HABITACIONES","B9500CS040S SHAMPOO ACONDICIONADOR DREA","BOTE C/100",100,0,920,"DISPONE","Amenidades_de_baño","B9500CS040S SHAMPOO ACONDICIONADOR DREA",0.03,0]
[1669,"HABITACIONES","B9500SG040S GEL DE BAÑO DREAMS G&S 100/","BOTE C/100",100,0,1009,"DISPONE","Amenidades_de_baño","B9500SG040S GEL DE BAÑO DREAMS G&S 100/",0.03,0]
[35681,"HABITACIONES","SHAMPOO Y ACONDICIONADOR DE 1.18 OZ","PIEZA",1,0,4.95,"DISPONE","Amenidades_de_baño","SHAMPOO Y ACONDICIONADOR DE 1.18 OZ",0.01,0]
[45554,"HABITACIONES","GEL ALCOHOL SANITIZANTE 60 ML CON LOGO","PIEZA",1,0,7.68,"DISPONE","Amenidades_de_baño","GEL ALCOHOL SANITIZANTE 60 ML CON LOGO",0.01,0]
[1655,"COCINA","VITAFILM DE 18\" 1500 MTS","PIEZA",1,0,295.33999999999997,"DISPONE","Protección_de_alimentos","VITAFILM DE 18\" 1500 MTS",5,0]
[56996,"ÁREAS PÚBLICAS","BOLSA NEGRA P/BASUR 90X1.20 LARGO CAL20","PAQUETE 14 KG",100,0,35.56,"DISPONE","Bolsa_de_residuos","BOLSA NEGRA P/BASUR 90X1.20 LARGO CAL20",0.05,0]
[56998,"ÁREAS PÚBLICAS","BOLSA TRANSP 40X60 CM 200 P/BASURA","PAQUETE 48 KG",100,0,52.49,"DISPONE","Bolsa_de_residuos","BOLSA TRANSP 40X60 CM 200 P/BASURA",2.7E-2,0]
[56999,"ÁREAS PÚBLICAS","BOLSA TRANSP DE 1 X 1.2 MT CAL 300 P/HI","PAQUETE 7 KG",100,0,54.16,"DISPONE","Bolsa_de_residuos","BOLSA TRANSP DE 1 X 1.2 MT CAL 300 P/HI",0.05,0]
{"$rows_left_out":8}
{"sheet":"BD SEGUIMIENTO MENSUAL","index":7,"n_rows":241,"n_cols":18,"rows_kept":241,"cut":false,"hidden":false,"merged":[]}
["No. IDENTIFICADOR","ÁREA DEL HOTEL","PRODUCTO DE PLÁSTICO","TIPO DE EMPAQUE","CANTIDAD DE PRODUCTO POR EMPAQUE","CANTIDAD DE EMPAQUES ADQUIRIDOS","GASTO REALIZADO POR CADA DE EMPAQUE","TIPO DE MANEJO","CATEGORÍA DEL PRODUCTO","TIPO DE PRODUCTO","PESO DEL PRODUCTO DE PLÁSTICO","TIPO DE PLÁSTICO","Año","Mes",null,"CANTIDAD TOTAL DE PRODUCTO ADQUIRIDO","GASTO DE ADQUISICIÓN MENSUAL ","PESO TOTAL MENSUAL DEL PRODUCTO"]
[1090,"HABITACIONES","COFFE KIT REGULAR P/4 TAZAS C/CAFE/AZUC","PIEZA",1,0,9.91,"DISPONE","Kit_de_café","COFFE KIT REGULAR P/4 TAZAS C/CAFE/AZUC",1E-3,0,2023,"Enero"]
[30544,"HABITACIONES","CAFE DECAF PQT/C/50 PZA 2 GR","FRASCO C/50",50,0,66.540000000000006,"DISPONE","Kit_de_café","CAFE DECAF PQT/C/50 PZA 2 GR",1E-3,0,2023,"Enero"]
[1742,"HABITACIONES","89330 - PAÑUELOS FACIALES KLEENEX BLAN","CAJA C/72",72,23,809,"DISPONE","Amenidades_de_baño","89330 - PAÑUELOS FACIALES KLEENEX BLAN",2E-3,0,2023,"Enero"]
[1744,"HABITACIONES","90498 - HIGIENICO TRAD KLEENEX COTONELL","PAQUETE C/72",72,29,605.12,"DISPONE","Amenidades_de_baño","90498 - HIGIENICO TRAD KLEENEX COTONELL",0.05,0,2023,"Enero"]
[1667,"HABITACIONES","B9500BL040S CREMA CORPORAL DREAMS G&S 1","BOTE C/100",100,14,955,"DISPONE","Amenidades_de_baño","B9500BL040S CREMA CORPORAL DREAMS G&S 1",0.03,0,2023,"Enero"]
[1668,"HABITACIONES","B9500CS040S SHAMPOO ACONDICIONADOR DREA","BOTE C/100",100,20,920,"DISPONE","Amenidades_de_baño","B9500CS040S SHAMPOO ACONDICIONADOR DREA",0.03,0,2023,"Enero"]
[1669,"HABITACIONES","B9500SG040S GEL DE BAÑO DREAMS G&S 100/","BOTE C/100",100,19,1009,"DISPONE","Amenidades_de_baño","B9500SG040S GEL DE BAÑO DREAMS G&S 100/",0.03,0,2023,"Enero"]
[35681,"HABITACIONES","SHAMPOO Y ACONDICIONADOR DE 1.18 OZ","PIEZA",1,null,4.95,"DISPONE","Amenidades_de_baño","SHAMPOO Y ACONDICIONADOR DE 1.18 OZ",0.01,0,2023,"Enero"]
[45554,"HABITACIONES","GEL ALCOHOL SANITIZANTE 60 ML CON LOGO","PIEZA",1,576,7.68,"DISPONE","Amenidades_de_baño","GEL ALCOHOL SANITIZANTE 60 ML CON LOGO",0.01,0,2023,"Enero"]
[1655,"COCINA","VITAFILM DE 18\" 1500 MTS","PIEZA",1,115,295.33999999999997,"DISPONE","Protección_de_alimentos","VITAFILM DE 18\" 1500 MTS",5,0,2023,"Enero"]
[56996,"ÁREAS PÚBLICAS","BOLSA NEGRA P/BASUR 90X1.20 LARGO CAL20","PAQUETE 14 KG",100,575,35.56,"DISPONE","Bolsa_de_residuos","BOLSA NEGRA P/BASUR 90X1.20 LARGO CAL20",0.05,0,2023,"Enero"]
[56998,"ÁREAS PÚBLICAS","BOLSA TRANSP 40X60 CM 200 P/BASURA","PAQUETE 48 KG",100,125,52.49,"DISPONE","Bolsa_de_residuos","BOLSA TRANSP 40X60 CM 200 P/BASURA",2.7E-2,0,2023,"Enero"]
[56999,"ÁREAS PÚBLICAS","BOLSA TRANSP DE 1 X 1.2 MT CAL 300 P/HI","PAQUETE 7 KG",100,100,54.16,"DISPONE","Bolsa_de_residuos","BOLSA TRANSP DE 1 X 1.2 MT CAL 300 P/HI",0.05,0,2023,"Enero"]
[60204,"ÁREAS PÚBLICAS","BOLSA GLASINE ENCERADA TAMAÑO PALOMITAS","PAQUETE C/1000",100,16,62.01,"DISPONE","Bolsa_de_residuos","BOLSA GLASINE ENCERADA TAMAÑO PALOMITAS",0.02,0,2023,"Enero"]
{"$rows_left_out":227}
{"sheet":"FICHAS TÉCNICAS DE PLÁSTICOS","index":8,"n_rows":150,"n_cols":6,"rows_kept":150,"cut":false,"hidden":false,"merged":[[2,3,2,5],[1,1,1,5],[3,1,3,5]]}
[]
[null,"FICHAS TÉCNICAS DE PLÁSTICOS"]
[]
[null,"En esta hoja, se muetran las características de los productos de plástico que pueden encontrarse dentro de la organización. Estos datos son utilizados para complementar la información de línea base. Es importante considerar que son ejemplos que se pueden utilizar cuando no se realiza el pesaje directo de los productos ni se identifica el tipo de plástico."]
[]
[null,"Categoría","Nombre de categoría","Descripción","PESO POR UNIDAD EN KILOGRAMOS","TIPO DE PLÁSTICO"]
[null,"Acceso_e_identificación",{"$f":"SUBSTITUTE(B7,\"_\",\" \")","v":"Acceso e identificación"},"TARJETA ELECTRONICA P/HABTACIONES NARANJA CON LOGO",5.0000000000000001E-3,"PVC"]
[null,"Acceso_e_identificación","Acceso e identificación","Brazalete",2E-3,"PP"]
[null,"Agua_embotellada","Agua embotellada","Botella para agua 330 ml",1.4999999999999999E-2,"PET"]
[null,"Agua_embotellada","Agua embotellada","Botella para agua 400 ml ",1.4999999999999999E-2,"PET"]
[null,"Agua_embotellada","Agua embotellada","Botella para agua 500 ml",1.4999999999999999E-2,"PET"]
[null,"Agua_embotellada",{"$f":"SUBSTITUTE(B12,\"_\",\" \")","v":"Agua embotellada"},"AGUA E PURA DE 600 MIL C/12 BOTELLAS    ",2.3E-2]
[null,"Agua_embotellada","Agua embotellada","Botella para agua 1 l",2.4E-2,"PET"]
[null,"Agua_embotellada","Agua embotellada","AGUA EN GARRAFON 19 LT                  ",0.75]
[null,"Agua_embotellada","Agua embotellada","Botella para agua 1.5 l",0.36,"PET"]
{"$rows_left_out":135}