{"text_format":"1","workbook":"xlsx","n_sheets":29,"sheets":["COMPILADO","Resultados Consolidados","Instrucciones Consolidar","Bienvenida","1. Introducción","1a. Instrucciones de Trabajo","1b. Flujo de trabajo","1c. Registrar datos proyecto","2. Preparar evaluación","2a. Componentes Agua","Agua","RegistroA","Impactos Data","2b Componentes Biodiversidad","Biodiversidad","RegistroB","2c. Componentes Movilidad","Movilidad","RegistroM","2d Componentes Espacio Público","Espacio Público","RegistroP","3. Recoleccion de datos","RegistroDatos","RegistroTotal","4. Impactos-Resultados","Resumen Resultados","Datos","Impactos"],"not_rendered":{"charts":2,"images":33,"macros":1,"external_links":0,"defined_names":2,"comments":1,"pivot_tables":0},"unopened":[],"bounds":{"document_bytes":16777216,"sheet_cells":100000,"rows_first":2000,"rows_last":500,"rows_between":2000,"halvings":0,"cell_chars":16384,"cell_head_chars":4096},"cells_cut":0,"cells_raw":0,"read":"whole","date_system":"1900"}

{"sheet":"COMPILADO","index":0,"n_rows":17,"n_cols":22,"rows_kept":17,"cut":false,"hidden":true,"merged":[]}
[]
[]
[]
[null,"Eje","Adaptación","Adaptación","Adaptación","Adaptación","Adaptación","Mitigación","Mitigación","Ambiental","Ambiental","Ambiental","Ambiental","Ambiental","Ambiental","Social","Social","Sociales","Social","Social","Económicos","Económicos"]
[null,"Impacto ",1,2,3,4,5,6,7,8,9,10,11,12,13,14,15,16,17,18,19,20]
[null,"Agua",5,3,3,1,0,0,0,0,5,1,2,0,0,1,1,0,0,1,1,1]
[null,"Biodiversidad",3,3,3,3,3,3,0,3,2,3,3,3,3,3,1,2,3,2,1,1]
[null,"Movilidad",0,0,0,0,0,0,0,0,0,0,0,0,0,0,0,0,0,0,0,0]
[null,"Espacio Público",0,1,1,4,0,1,2,1,1,0,0,0,1,4,3,0,2,0,0,1]
[null,"Total impacto",{"$f":"SUM(C6:C9)","v":8},{"$f":"SUM(D6:D9)","v":7},7,8,3,4,2,4,8,4,5,3,4,8,5,2,5,3,2,3]
[]
[]
[null,"Adaptación",{"$f":"SUM(C10:G10)","v":33},{"$f":"C13/SUM($C$13:$C$17)","v":0.3473684210526316}]
[null,"Mitigación",{"$f":"SUM(H10:I10)","v":6},{"$f":"C14/SUM($C$13:$C$17)","v":6.3157894736842107E-2}]
[null,"Ambientales",{"$f":"SUM(J10:O10)","v":28},0.29473684210526313]
[null,"Sociales",{"$f":"SUM(P10:T10)","v":23},0.24210526315789474]
[null,"Económicos",{"$f":"SUM(U10:V10)","v":5},5.2631578947368418E-2]

{"sheet":"Resultados Consolidados","index":1,"n_rows":45,"n_cols":30,"rows_kept":45,"cut":false,"hidden":true,"merged":[[42,9,43,25],[44,24,44,25],[44,9,44,16],[44,17,44,23],[5,23,5,27],[47,9,47,16],[47,17,47,23],[48,9,48,16],[48,17,48,23],[17,16,17,21],[22,21,22,22],[23,9,24,10],[23,11,23,20],[23,21,23,22],[24,11,24,20],[24,21,24,22],[18,9,22,10],[18,11,18,20],[18,21,18,22],[19,11,19,20],[19,21,19,22],[20,11,20,20],[20,21,20,22],[21,11,21,20],[49,17,49,23],[50,9,50,16],[50,17,50,23],[51,9,51,16],[51,17,51,23],[46,24,46,25],[45,24,45,25],[45,9,45,16],[45,17,45,23],[46,9,46,16],[46,17,46,23],[50,24,50,25],[51,24,51,25],[48,24,48,25],[49,24,49,25],[47,24,47,25],[21,21,21,22],[22,11,22,20],[25,9,30,10],[25,11,25,20],[25,21,25,22],[26,11,26,20],[3,5,3,6],[5,3,5,5],[5,7,5,11],[5,13,5,16],[5,18,5,22],[7,1,8,4],[7,5,8,6],[14,1,14,3],[15,1,16,6],[15,9,16,24],[26,21,26,22],[27,11,27,20],[27,21,27,22],[28,11,28,20],[28,21,28,22],[29,11,29,20],[29,21,29,22],[30,11,30,20],[54,9,54,16],[54,17,54,23],[55,9,55,16],[55,17,55,23],[30,21,30,22],[36,9,37,10],[36,11,36,20],[36,21,36,22],[38,9,39,12],[38,13,39,14],[37,11,37,20],[37,21,37,22],[35,11,35,20],[35,21,35,22],[31,9,35,10],[31,11,31,20],[31,21,31,22],[32,11,32,20],[32,21,32,22],[33,11,33,20],[33,21,33,22],[34,11,34,20],[34,21,34,22],[49,9,49,16],[1,1,1,24],[58,24,58,25],[60,24,60,25],[60,9,60,16],[60,17,60,23],[59,24,59,25],[56,24,56,25],[57,24,57,25],[56,9,56,16],[56,17,56,23],[57,9,57,16],[57,17,57,23],[58,9,58,16],[58,17,58,23],[59,9,59,16],[59,17,59,23],[54,24,54,25],[55,24,55,25],[52,24,52,25],[53,24,53,25],[52,9,52,16],[52,17,52,23],[53,9,53,16],[53,17,53,23]]}
[]
[null,"Herramienta para la estimación y la evaluación de los impactos de la infraestructura verde"]
[]
[null,null,null,null,null,"1. Introducción ",null,null,null,null,"Instrucciones Consolidar"]
[]
[]
[]
[null,"Número de proyectos"]
[]
[]
[]
[]
[]
[]
[]
[null,"Contribución total de Impactos ",null,null,null,null,null,null,null,"Mapa de impactos consolidado"]
[]
[null,null,null,null,null,null,null,null,null,null,null,null,null,null,null,null,null,null,null,null,null,null,null,null,null,null,0.1,0.15,0.2,0.3]
[null,null,null,null,null,null,null,null,null,"Adaptación",null,{"$f":"\"  \"&Impactos!C2","v":"  Prevención de inundaciones, regulación de escorrentías"},null,null,null,null,null,null,null,null,null,{"$f":"COMPILADO!C10","v":8},null,{"$f":"Z19*F$8","v":0},{"$f":"IF(V19<=AA19,\"Muy Bajo\",IF(AND(V19>AA19,V19<AB19),\"Bajo\",IF(AND(V19>AB19,V19<AC19),\"Medio\",IF(AND(V19>AC19,V19<AD19),\" Alto\",IF(V19>=AD19,\"Muy Alto\")))))","v":"Muy Alto"},40.25,{"$f":"X19*$AA$18","v":0},{"$f":"X19*$AB$18","v":0},{"$f":"X19*$AC$18","v":0},{"$f":"X19*$AD$18","v":0}]
[null,null,null,null,null,null,null,null,null,null,null,{"$f":"\"  \"&Impactos!C3","v":"  Reducción de los riesgos derivados de las inundaciones, regulación de avenidas."},null,null,null,null,null,null,null,null,null,{"$f":"COMPILADO!D10","v":7},null,{"$f":"Z20*F$8","v":0},{"$f":"IF(V20<=AA20,\"Muy Bajo\",IF(AND(V20>AA20,V20<AB20),\"Bajo\",IF(AND(V20>AB20,V20<AC20),\"Medio\",IF(AND(V20>AC20,V20<AD20),\" Alto\",IF(V20>=AD20,\"Muy Alto\")))))","v":"Muy Alto"},36.5,{"$f":"X20*$AA$18","v":0},{"$f":"X20*$AB$18","v":0},{"$f":"X20*$AC$18","v":0},{"$f":"X20*$AD$18","v":0}]
[null,null,null,null,null,null,null,null,null,null,null,{"$f":"\"  \"&Impactos!C4","v":"  Incremento de la recarga de agua de los acuíferos"},null,null,null,null,null,null,null,null,null,{"$f":"COMPILADO!E10","v":7},null,0,"Muy Alto",39,0,0,0,0]
[null,null,null,null,null,null,null,null,null,null,null,{"$f":"\"  \"&Impactos!C5","v":"  Regulación térmica y disminución de las islas urbanas de calor"},null,null,null,null,null,null,null,null,null,{"$f":"COMPILADO!F10","v":8},null,0,"Muy Alto",35.25,0,0,0,0]
[null,null,null,null,null,null,null,null,null,null,null,{"$f":"\"  \"&Impactos!C6","v":"  Mejora de la conectividad ecológica."},null,null,null,null,null,null,null,null,null,{"$f":"COMPILADO!G10","v":3},null,0,"Muy Alto",33.25,0,0,0,0]
[null,null,null,null,null,null,null,null,null,"Mitigación",null,{"$f":"\"  \"&Impactos!C7","v":"  Secuestro de carbono "},null,null,null,null,null,null,null,null,null,{"$f":"COMPILADO!H10","v":4},null,0,"Muy Alto",26.75,0,0,0,0]
[null,null,null,null,null,null,null,null,null,null,null,{"$f":"\"  \"&Impactos!C8","v":"  Reducción de emisiones de GEI"},null,null,null,null,null,null,null,null,null,{"$f":"COMPILADO!I10","v":2},null,0,"Muy Alto",25.25,0,0,0,0]
[null,null,null,null,null,null,null,null,null,"Ambientales",null,{"$f":"\"  \"&Impactos!C9","v":"  Mejora de la calidad del aire"},null,null,null,null,null,null,null,null,null,{"$f":"COMPILADO!J10","v":4},null,0,"Muy Alto",29.25,0,0,0,0]
[null,null,null,null,null,null,null,null,null,null,null,{"$f":"\"  \"&Impactos!C10","v":"  Mejora de la calidad del agua (purificación del agua)"},null,null,null,null,null,null,null,null,null,{"$f":"COMPILADO!K10","v":8},null,0,"Muy Alto",35.25,0,0,0,0]
[null,null,null,null,null,null,null,null,null,null,null,{"$f":"\"  \"&Impactos!C11","v":"  Reducción de la contaminación por ruido"},null,null,null,null,null,null,null,null,null,{"$f":"COMPILADO!L10","v":4},null,0,"Muy Alto",29.5,0,0,0,0]
[null,null,null,null,null,null,null,null,null,null,null,{"$f":"\"  \"&Impactos!C12","v":"  Control de la erosión del suelo"},null,null,null,null,null,null,null,null,null,{"$f":"COMPILADO!M10","v":5},null,0,"Muy Alto",27.75,0,0,0,0]
[null,null,null,null,null,null,null,null,null,null,null,{"$f":"\"  \"&Impactos!C13","v":"  Mantenimiento, protección y mejora de hábitats, vida silvestre y biodiversidad"},null,null,null,null,null,null,null,null,null,{"$f":"COMPILADO!N10","v":3},null,0,"Muy Alto",32.25,0,0,0,0]
[null,null,null,null,null,null,null,null,null,null,null,{"$f":"\"  \"&Impactos!C14","v":"  Producción de servicios ecosistémicos"},null,null,null,null,null,null,null,null,null,{"$f":"COMPILADO!O10","v":4},null,0,"Muy Alto",31.25,0,0,0,0]
[null,null,null,null,null,null,null,null,null,"Sociales",null,{"$f":"\"  \"&Impactos!C15","v":"  Mejora de los valores estéticos"},null,null,null,null,null,null,null,null,null,{"$f":"COMPILADO!P10","v":8},null,0,"Muy Alto",49.5,0,0,0,0]
[null,null,null,null,null,null,null,null,null,null,null,{"$f":"\"  \"&Impactos!C16","v":"  Mejora accesibilidad de recursos para deporte, cultura, formación y recreación"},null,null,null,null,null,null,null,null,null,{"$f":"COMPILADO!Q10","v":5},null,0,"Muy Alto",38,0,0,0,0]
[null,null,null,null,null,null,null,null,null,null,null,{"$f":"\"  \"&Impactos!C17","v":"  Mejora de la salud y bienestar"},null,null,null,null,null,null,null,null,null,{"$f":"COMPILADO!R10","v":2},null,0,"Muy Alto",29.25,0,0,0,0]
[null,null,null,null,null,null,null,null,null,null,null,{"$f":"\"  \"&Impactos!C18","v":"  Generación de recursos comunitarios (fortalecimiento de la ciudadanía)"},null,null,null,null,null,null,null,null,null,{"$f":"COMPILADO!S10","v":5},null,0,"Muy Alto",39.25,0,0,0,0]
[null,null,null,null,null,null,null,null,null,null,null,{"$f":"\"  \"&Impactos!C19","v":"  Fortalecimiento de sentimiento de pertenencia e identidad"},null,null,null,null,null,null,null,null,null,{"$f":"COMPILADO!T10","v":3},null,0,"Muy Alto",35.25,0,0,0,0]
[null,null,null,null,null,null,null,null,null,"Económicos",null,{"$f":"\"  \"&Impactos!C20","v":"  Optimización de la inversión pública "},null,null,null,null,null,null,null,null,null,{"$f":"COMPILADO!U10","v":2},null,0,"Muy Alto",30.75,0,0,0,0]
[null,null,null,null,null,null,null,null,null,null,null,{"$f":"\"  \"&Impactos!C21","v":"  Atracción para negocios, turismo y economía verde"},null,null,null,null,null,null,null,null,null,{"$f":"COMPILADO!V10","v":3},null,0,"Muy Alto",40.75,0,0,0,0]
[]
[null,null,null,null,null,null,null,null,null,null,null,null,null,null,null,17]
[]
[]
[null,null,null,null,null,null,null,null,null,"Proyectos Seleccionados"]
[]
[null,null,null,null,null,null,null,null,null,"Nombre Proyecto",null,null,null,null,null,null,null,"Estado",null,null,null,null,null,null,"Año ejecución"]

{"sheet":"Instrucciones Consolidar","index":2,"n_rows":18,"n_cols":11,"rows_kept":18,"cut":false,"hidden":true,"merged":[[17,1,24,14],[1,1,1,23],[3,5,3,6],[8,1,10,11],[16,1,16,14],[13,1,13,12]]}
[]
[null,"Herramienta para la estimación y evaluación de los impactos de la infraestructura verde"]
[]
[null,null,null,null,null,"1. Introducción ",null,null,null,null,"Resultados Consolidados"]
[]
[]
[]
[null,"Acerca de esta pestaña:"]
[null,"Detalla los pasos a seguir e información relevante sobre la administración del workbook"]
[]
[]
[]
[]
[null,"Instrucciones para consolidar la evaluación de varios proyectos"]
[]
[]
[null,"Pasos "]
[null,"   1. Abrir todos los archivos excel de los proyectos que se requieren consolidar. \n\n   2. En la pestaña Resultados Consolidados dar click en el ícono Importar Proyectos\n\n   3. Seleccionar los archivos y dar click en Importar\n\n   4. Revisar el mapa de impactos consolidado \n\nIMPORTANTE: Para que funcione correctamente el macro de consolidación requiere importar todos los proyectos al mismo tiempo. "]

{"sheet":"Bienvenida","index":3,"n_rows":45,"n_cols":18,"rows_kept":45,"cut":false,"hidden":false,"merged":[[11,1,11,9],[15,2,18,5],[1,3,6,21]]}
[]
[null,null,null,"Herramienta para la estimación y evaluación de los                 impactos de la infraestructura verde"]
[]
[]
[]
[]
[]
[]
[]
[]
[]
[null,"   Bienvenida"]
[]
[]
[]
[null,null,"¿Qué deseas realizar?"]
[]
[]
[]
[]
[]
[]
[]
[]
[]
[]
[]
[]
[]
[]
[]
[]
[]
[]
[]
[]
[]
[]
[]
[]
[]
[]
[]
[]
[null,null,null,null,null,null,null,null,null,null,null,null,null,null,null,null,null," "]

{"sheet":"1. Introducción","index":4,"n_rows":57,"n_cols":20,"rows_kept":57,"cut":false,"hidden":false,"merged":[[1,1,1,23],[56,4,75,22],[25,4,45,22],[25,23,35,23],[36,23,45,23],[47,4,47,23],[48,4,54,22],[13,1,13,9],[16,4,22,22],[24,4,24,23],[8,1,10,12],[55,4,55,23]]}
[]
[null,"Herramienta para la estimación y evaluación de los impactos de la infraestructura verde"]
[]
[null,null,null,null,null,"1. Introducción ",null,null,null,"2. Preparar evaluación ",null,null,null,null,"3. Recolección de datos",null,null,null,null,"4. Impactos/Resultados"]
[]
[null,null,null,null,null,null,"1a. Instrucciones de trabajo",null,null,null,null,"1b. Flujo de trabajo",null,null,null,"1c. Registrar datos de proyecto"]
[]
[null,"Acerca de esta pestaña:"]
[null,"Esta pestaña presenta los propósitos de la herramienta y la metodología "]
[]
[]
[]
[]
[null,"1. Introducción"]
[]
[]
[null,null,null,null,"El concepto de Infraestructura Verde (IV) da cuenta de la gran cantidad de definiciones, no solamente por la disciplina desde la cuál se está proponiendo la definición (no es lo mismo que se defina desde la ingeniería civil, la arquitectura, la biología, el urbanismo, etc.), sino por la gran cantidad de componentes que la integran de acuerdo con expertos y defensores de ella, desde elementos físicos que forman parte del espacio urbano (desde jardineras, pavimentos, arbolado, etc.) hasta las instalaciones hidráulicas, sanitarias y en general la edificación."]
[]
[]
[]
[]
[]
[]
[]
[]
[null,null,null,null,"Evaluar un proyecto\n\nEsta herramienta permite evaluar a través de los elementos que constituyen cada uno de los ejes de Infraestructura verde, agua, biodiversidad, movilidad y espacio público, el impacto de un proyecto en la mitigación y adaptación al cambio climático.  Se han propuesto como base principal de la herramienta 20 impactos destacados, clasificados en impactos de adaptación-mitigación, social, ambiental y económico. A su vez se han identificado y definido 25 componentes de la infraestructura verde que se catalogan en cada uno de los ejes citados. \n\nUtilizando como indicador los resultados que ofrecen los componentes por cada uno de los impactos, se ha podido generar una matriz que explicita el grado de intervención de un elemento (p.e, arbolado urbano) sobre un impacto (p.e, Mejora de la calidad del aire). Finalmente, al desarrollar la evaluación de doble dirección por cada uno impactos frente a componentes, obtenemos una matriz que evalúa el gradiente de implicación (directa, media, indirecta o nula) del elemento sobre el impacto específico, pudiendo finalmente obtener la evaluación cualitativa global de un proyecto dependiendo de los elementos de IV que incorpora.\n\nConsolidar resultados de evaluación \n\nLa herramienta cuenta con un módulo para consolidar los resultados de evaluaciones individuales de proyectos permitiendo de manera fácil generar un mapa de impactos de un grupo de proyectos. "]
[]
[]
[]
[]
[]
[]
[]
[]
[]
[]
[]
[]
[]
[]
[]
[]
[]
[]
[]
[]
[]
[]
[null,null,null,null,"La herramienta está diseñada para dotar a los usuarios de un marco sólido para evaluar los proyectos de la vertiente Mejoramiento Integral de Barrios del Programa de Mejoramiento Urbano de la SEDATU. Se considera que los usuarios serán fundamentalmente los servidores públicos de la SEDATU, responsables de dar seguimiento a los proyectos, obras y acciones financiadas a través de esta vertiente, en particular, proyectos de mejoramiento del espacio público, ámbito territorial susceptible de incorporar elementos de Infraestructura Verde (IV)."]
[]
[]
[]
[]
[]
[]
[]
[null,null,null,null,"\nLa metodología está diseñada para evaluar proyectos que tienen al menos algún componente de infraestructura verde.\n\nLos elementos de la metodología propuesta adoptan los siguientes principios: orientación imparcial, impactos positivos, enfoque de arriba hacia abajo, impacto contingente y agregación de impactos\n\nSe utiliza la lógica de intervención o teoría del cambio como fundamento teórico para dar respuesta a cómo los componentes de la IV de un proyecto conducen a resultados e impactos o beneficios concretos. El mapeo de los impactos establece la estructura general de la metodología y guía la evaluación de los proyectos ya que identifica todas las interconexiones entre los componentes de infraestructura verde y cada uno de los 20 impactos de la clasificación. \n\nLos mapas son una simplificación de la realidad, son modelos de las situaciones observadas que informan sus vínculos teóricos de causalidad, pero no son específicas del contexto; lo que significa que ilustran los potenciales impactos de la implementación de los componentes de IV en cualquier lugar. La definición de la relación se basa en información empírica, datos recopilados, informes de evaluación y casos de estudio según el componente de análisis. En otras palabras, los mapas desarrollados se basan en evidencia de relaciones causales de impactos observados luego de intervenciones reales (ex-post). \n\n\n\n"]

{"sheet":"1a. Instrucciones de Trabajo","index":5,"n_rows":38,"n_cols":21,"rows_kept":38,"cut":false,"hidden":false,"merged":[[37,1,37,4],[37,5,37,14],[32,5,32,14],[33,1,33,4],[33,5,33,14],[34,1,34,4],[34,5,34,14],[32,1,32,4],[35,1,35,4],[35,5,35,14],[23,1,23,14],[20,19,21,20],[20,16,21,17],[36,1,36,4],[36,5,36,14],[28,1,28,4],[28,5,28,14],[29,1,29,4],[29,5,29,14],[30,1,30,4],[19,2,19,14],[20,2,20,14],[21,2,21,14],[16,1,16,14],[17,2,17,14],[1,1,1,23],[3,5,3,6],[8,1,10,11],[31,1,31,4],[31,5,31,14],[30,5,30,14],[13,1,13,9],[25,1,25,4],[25,5,25,14],[27,1,27,4],[27,5,27,14],[16,16,16,19],[18,16,18,19],[23,16,23,20],[25,16,32,20],[18,2,18,14]]}
[]
[null,"Herramienta para la estimación y evaluación de los impactos de la infraestructura verde"]
[]
[null,null,null,null,null,"1. Introducción ",null,null,null,"2. Preparar evaluación ",null,null,null,null,"3. Recolección de datos",null,null,null,null,"4. Impactos/Resultados"]
[]
[null,null,null,null,null,null,"1a. Instrucciones de trabajo",null,null,null,null,"1b. Flujo de trabajo",null,null,null,"1c. Registrar datos de proyecto"]
[]
[null,"Acerca de esta pestaña:"]
[null,"Detalla los pasos a seguir e información relevante sobre la administración del workbook"]
[]
[]
[]
[]
[null,"1a. Instrucciones de trabajo"]
[]
[]
[null,"Pasos ",null,null,null,null,null,null,null,null,null,null,null,null,null,null,"Versión de la herramienta ",null,null,null,"V1"]
[null,1,"Registrar datos de proyecto"]
[null,2,"Seleccionar los ejes en los que se quiere realizar la evaluación",null,null,null,null,null,null,null,null,null,null,null,null,null,"Password ",null,null,null,333]
[null,3,"Seleccionar los componentes de infraestructura verde que son implementados en el proyecto "]
[null,4,"Responder a las preguntas de cada componente seleccionado",null,null,null,null,null,null,null,null,null,null,null,null,null,"Mostrar celdas de trabajo",null,null,"Ocultar celdas de trabajo"]
[null,5,"Generar el resumen de resultados "]
[]
[null,"Contenidos",null,null,null,null,null,null,null,null,null,null,null,null,null,null,"Recomendaciones"]
[]
[null,"Nombre pestaña",null,null,null,"Contenidos",null,null,null,null,null,null,null,null,null,null,"Para el correcto funcionamiento de la herramienta se recomienda:\n\n     1. Habilitar los macros \n\n     2. No cambiar el formato \n\n    3. No añadir filas ni columnas\n\n    4. No eliminar las pestañas ocultas\n\n    5. Utilizar un archivo por proyecto "]
[]
[null,"1. Introducción",null,null,null,"Esta pestaña presenta los propósitos de la herramienta y la metodología "]
[null,"1a. Instrucciones de Trabajo",null,null,null,"Detalla los pasos a seguir e información relevante sobre la administración del workbook"]
[null,"1b. Flujo de trabajo ",null,null,null,"Esta sección describe el flujo de trabajo de la herramienta y los pasos necesarios para realizar la evaluación del proyecto del PMU. "]
[null,"1c. Registrar datos proyecto",null,null,null,"En esta pestaña se piden registrar los datos generales del proyecto. "]
[null,"2. Preparar evaluación",null,null,null,"Esta sección permite habilitar las pestañas de los componentes de cada eje para su evaluación. Seleccionando el eje aparece la pestaña correspondiente."]
[null,"2a. Componentes Agua",null,null,null,"Esta pestaña tiene la definición de los componentes de IV del eje de Agua"]
[null,"2b. Componentes Biodiversidad",null,null,null,"Esta pestaña tiene la definición de los componentes de IV del eje de Biodiversidad",null,null,null,null,null,null,null,null,null,null,null,null,null," "]
[null,"2c. Componentes Movilidad",null,null,null,"Esta pestaña tiene la definición de los componentes de IV del eje de Movilidad"]
[null,"2d. Componentes Espacio Público",null,null,null,"Esta pestaña tiene la definición de los componentes de IV del eje de Espacio Público"]
[null,"3. Recolección de datos",null,null,null,"Esta pestaña recolecta los datos necesarios para la estimación de GEI y otros impactos relevantes"]
[null,"4. Impactos/Resultados",null,null,null,"Esta sección presenta el mapa de impactos de los componentes de infraestructura verde seleccionados  y permite generar un reporte de resultados en un archivo aparte."]

{"sheet":"1b. Flujo de trabajo","index":6,"n_rows":39,"n_cols":20,"rows_kept":39,"cut":false,"hidden":false,"merged":[[1,1,1,23],[38,2,41,17],[3,19,3,21],[22,2,22,7],[3,9,3,11],[3,5,3,7],[13,1,13,9],[17,2,20,17],[3,14,3,16],[8,1,9,17],[23,2,29,17],[31,2,31,7],[32,2,35,17],[37,2,37,7]]}
[]
[null,"Herramienta para la estimación y evaluación de los impactos de la infraestructura verde"]
[]
[null,null,null,null,null,"1. Introducción ",null,null,null,"2. Preparar evaluación ",null,null,null,null,"3. Recolección de datos",null,null,null,null,"4. Impactos/Resultados"]
[]
[null,null,null,null,null,null,"1a. Instrucciones de trabajo",null,null,null,null,"1b. Flujo de trabajo",null,null,null,"1c. Registrar datos de proyecto"]
[]
[null,"Acerca de esta pestaña:"]
[null,"Esta sección describe el flujo de trabajo de la herramienta y los pasos necesarios para realizar la evaluación del proyecto del PMU. "]
[]
[]
[]
[]
[null,"1b. Flujo de trabajo "]
[]
[]
[null,null,"Registrar el proyecto:  "]
[null,null,"El primer paso es registrar la información del proyecto que permita conocer las características específicas de la actividad, dar detalle de la situación antes del proyecto y anotar datos del ejercicio de evaluación.  \nLa pestaña de registro puede ser accesada dando clik a la flecha o usando los links de navegación en la parte superior de la pestaña. "]
[]
[]
[]
[]
[null,null,"Preparar la evaluación:  "]
[null,null,"El segundo paso es registrar los componentes de Infraestructura Verde (IV) que contienen los proyectos para cada uno de los ejes: AGUA, BIODIVERSIDAD, MOVILIDAD y ESPACIO PÚBLICO.  Para algunos componentes identificados se contestan algunas preguntas para registrar la presencia o ausencia de ciertas características para poder identificar en qué grupos de impactos el proyecto está contribuyendo positivamente y con qué grado de impacto. \nLa pestaña para identificar los componentes de IV puede ser accesada dando clik a la flecha o usando los links de navegación en la parte superior de la pestaña. "]
[]
[]
[]
[]
[]
[]
[]
[null,null,"Recolección de datos:  "]
[null,null,"El siguiente paso es recopilar los datos de los impactos del proyecto. Se hace énfasis en la estimación de la reducción de emisiones GEI  y en algunos otros impactos que sean relevantes para el contexto mexicano.  \nLa pestaña de registro puede ser accesada dando clik a la flecha o usando los links de navegación en la parte superior de la pestaña. "]
[]
[]
[]
[]
[null,null,"Presentación de resultados:  "]
[null,null,"El último paso es revisar el mapa de impactos generado con base a los componente de IV elegidos y las respuestas dadas. Los impactos están orginazados por Climáticos (Mitigación y Adaptación), Ambientales, Sociales y Económicos. \nLa pestaña de resultados puede ser accesada dando clik a la flecha o usando los links de navegación en la parte superior de la pestaña. "]

{"sheet":"1c. Registrar datos proyecto","index":7,"n_rows":26,"n_cols":20,"rows_kept":26,"cut":false,"hidden":false,"merged":[[16,7,16,11],[18,1,18,6],[18,7,18,11],[16,13,16,16],[16,17,18,23],[26,1,26,5],[20,1,20,6],[20,7,20,11],[24,1,24,6],[24,7,24,11],[23,1,23,6],[23,7,23,11],[25,1,25,6],[22,1,22,6],[21,1,21,6],[25,7,25,11],[21,7,21,11],[21,13,25,23],[8,18,9,20],[22,7,22,11],[10,18,10,20],[1,1,1,23],[15,1,15,5],[20,13,20,23],[10,1,10,17],[13,1,13,9],[3,5,3,6],[8,1,9,17],[19,1,19,6],[19,7,19,11],[17,1,17,6],[17,7,17,11],[16,1,16,6]]}
[]
[null,"Herramienta para la estimación y evaluación de los impactos de la infraestructura verde"]
[]
[null,null,null,null,null,"1. Introducción ",null,null,null,"2. Preparar evaluación ",null,null,null,null,"3. Recolección de datos",null,null,null,null,"4. Impactos/Resultados"]
[]
[null,null,null,null,null,null,"1a. Instrucciones de trabajo",null,null,null,null,"1b. Flujo de trabajo",null,null,null,"1c. Registrar datos de proyecto"]
[]
[null,"Acerca de esta pestaña:"]
[null,"En esta pestaña se piden registrar los datos generales del proyecto. "]
[]
[]
[]
[]
[null,"1c. Registrar datos de proyecto "]
[]
[]
[null,"    Clave del Proyecto",null,null,null,null,null,null,null,null,null,null,null,"Nombre del Proyecto"]
[null,"    Estado"]
[null,"    Municipio"]
[null,"    Año de ejecución"]
[null,"    Superficie/ área de intervención (m2)",null,null,null,null,null,null,null,null,null,null,null,"Notas y observaciones: "]
[null,"    Modalidad"]
[null,"    Clima"]
[null,"    Presupuesto total ",null,null,null,null,null,null,null,null,null,null,"   "]
[null,"   Población beneficiaria"]
[null,"   Situación antes del proyecto"]

{"sheet":"2. Preparar evaluación","index":8,"n_rows":27,"n_cols":20,"rows_kept":27,"cut":false,"hidden":false,"merged":[[27,3,27,4],[8,1,10,12],[26,3,26,4],[26,8,26,9],[1,1,1,23],[26,13,26,14],[26,18,26,19],[5,3,5,5],[5,7,5,11],[5,13,5,16],[5,18,5,22],[16,1,17,11],[13,1,13,9],[3,5,3,6],[3,9,3,11]]}
[]
[null,"Herramienta para la estimación y evaluación de los impactos de la infraestructura verde"]
[]
[null,null,null,null,null,"1. Introducción ",null,null,null,"2. Preparar evaluación ",null,null,null,null,"3. Recolección de datos",null,null,null,null,"4. Impactos/Resultados"]
[]
[]
[]
[null,"Acerca de esta pestaña:"]
[null,"Esta sección permite habilitar las pestañas de los componentes de cada eje para su evaluación. \n"]
[]
[]
[]
[]
[null,"2. Preparar evaluación "]
[]
[]
[null,"Selecciona el eje para que aparezca la pestaña de evaluación correspondiente."]
[]
[]
[]
[]
[]
[]
[]
[]
[]
[null,null,null,"P",null,null,null,null,"P",null,null,null,null,"P",null,null,null,null,"P"]

{"sheet":"2a. Componentes Agua","index":9,"n_rows":189,"n_cols":22,"rows_kept":189,"cut":false,"hidden":true,"merged":[[23,14,23,16],[26,2,35,11],[3,5,3,6],[3,9,3,11],[8,1,10,8],[13,1,13,9],[22,1,24,12],[26,14,27,20],[23,17,23,19],[26,21,27,21],[29,14,30,20],[29,21,30,21],[32,14,34,20],[32,21,33,21],[55,1,57,12],[56,14,56,16],[36,2,37,2],[36,3,38,12],[40,1,42,12],[41,14,41,16],[44,14,45,20],[41,17,41,19],[56,17,56,19],[44,21,45,21],[47,14,49,20],[47,21,48,21],[51,2,52,2],[51,3,52,12],[44,2,50,11],[59,21,60,21],[62,14,63,20],[62,21,63,21],[65,14,66,20],[65,21,67,21],[74,14,74,16],[77,2,85,12],[77,14,78,20],[59,14,60,20],[59,2,68,11],[74,17,74,19],[86,2,87,2],[86,3,87,12],[69,2,70,2],[69,3,71,12],[73,1,75,12],[77,21,78,21],[80,14,81,20],[80,21,81,21],[83,14,84,20],[83,21,84,21],[94,21,95,21],[97,14,98,20],[97,21,98,21],[100,14,101,20],[100,21,101,21],[90,1,92,12],[91,14,91,16],[94,2,112,12],[94,14,95,20],[103,14,104,20],[91,17,91,19],[113,21,114,21],[118,1,120,12],[119,14,119,16],[103,21,104,21],[106,14,107,20],[106,21,107,21],[109,14,111,20],[109,21,110,21],[139,14,140,20],[113,2,115,2],[113,3,115,12],[113,14,114,20],[139,2,148,12],[122,2,130,12],[119,17,119,19],[131,2,132,2],[157,21,158,21],[160,14,161,20],[160,21,161,21],[170,2,171,2],[170,3,171,12],[157,14,158,20],[157,2,169,12],[1,1,1,23],[154,17,154,19],[149,2,150,2],[153,1,155,12],[154,14,154,16],[149,3,151,13],[139,21,140,21],[142,14,144,20],[142,21,143,21],[122,14,123,20],[122,21,123,21],[125,14,126,20],[136,17,136,19],[131,3,132,12],[135,1,137,12],[136,14,136,16]]}
[]
[null,"Herramienta para la estimación y evaluación de los impactos de la infraestructura verde"]
[]
[null,null,null,null,null,"1. Introducción ",null,null,null,"2. Preparar evaluación ",null,null,null,null,"3. Recolección de datos",null,null,null,null,"4. Impactos/Resultados"]
[]
[null,null,null,null,null,null,"2a. Componentes AGUA",null,null,null,"2b. Componentes BIODIVERSIDAD",null,null,null,null,"2c. Componentes MOVILIDAD",null,null,null,null,"2d. Componentes ESPACIO PUBLICO"]
[]
[null,"Acerca de esta pestaña:"]
[null,"Esta pestaña tiene la definición de los componentes de IV del eje de Agua"]
[]
[]
[]
[]
[null,"2a. Selección de componentes de IV del eje AGUA"]
[]
[]
[]
[]
[]
[]
[]
[]
[null,{"$f":"\"    \"&Agua!B3","v":"    BIODIGESTORES"}]
[null,null,null,null,null,null,null,null,null,null,null,null,null,null,"Presupuesto asignado",null,null,0,null,null,null,{"$f":"Agua!B2","v":"CA1"}]
[]
[]
[null,null,{"$f":"Agua!B4","v":"Se refiere a un contenedor cerrado de forma hermética que contiene residuos orgánicos de origen vegetal o animal para generar biogas con trazas de otros gases como fuente de energía. "},null,null,null,null,null,null,null,null,null,null,null,{"$f":"\"          \"&Agua!B7","v":"          Número de biodigestores"}]
[]
[]
[null,null,null,null,null,null,null,null,null,null,null,null,null,null,{"$f":"\"          \"&Agua!B8","v":"          Capacidad de los biodigestores (aproximada)"}]
[]
[]
[null,null,null,null,null,null,null,null,null,null,null,null,null,null,{"$f":"\"          \"&Agua!B12","v":"          El biodigestor contiene algún sistema de filtración del agua \n           restante que evite la contaminación de los acuíferos? \n          (humedal artificial, plantas filtrantes,…)"}]
[]
[]
[]
[null,null,{"$f":"IF(D37=0,\" \",\"Fuente:\")","v":"Fuente:"},{"$f":"Agua!B5","v":"Ortiz-Moreno, J. A., Masera-Cerutti, O., & Fuentes-Gutierrez, A. F. (2014). La ecotecnología en México (Primera ed., p. 126). México, D. F.: Imagia. https://ecotec.unam.mx/ecoteca/biodigestores-2\nhttp://www.scielo.org.mx/scielo.php?script=sci_arttext&pid=S1870-57662018000200235\n"}]
[]
[]
[]
[null,{"$f":"\"    \"&Agua!C3","v":"    PRESAS FILTRANTES"}]
[null,null,null,null,null,null,null,null,null,null,null,null,null,null,"Presupuesto asignado",null,null,0,null,null,null,{"$f":"Agua!C2","v":"CA2"}]
[]
[]
[null,null,{"$f":"Agua!C4","v":"Se refiere a la acumulación de tierras/piedra/arena anexa a las las banquetas (aceras) que tiene por objeto retener sólidos y aumentar la infiltración de un cauce proximo a la infraestructura."},null,null,null,null,null,null,null,null,null,null,null,{"$f":"\"          \"&Agua!C7","v":"          Superficie aproximada (m2)"}]
[]
[]
[null,null,null,null,null,null,null,null,null,null,null,null,null,null,{"$f":"\"          \"&Agua!C12","v":"          ¿El área de la presa es protegida (cerca y tapa) evitando la \n          contaminación por agentes externos \n          (hojas, animales, etc.)?"}]
[]
[]
[]
[null,null,{"$f":"IF(D52=0,\" \",\"Fuente:\")","v":"Fuente:"},{"$f":"Agua!C5","v":"El anillo verde Interior. Hacia una infraestructura Verde Urbana en Vitoria-Gasteiz. Ayuntamiento de Vitoria-Gasteiz\nhttps://silo.tips/queue/cultura-y-manejo-adecuado-del-agua?&queue_id=-1&v=1632729959&u=MzEuNC4yNDcuMjI4"}]
[]
[]
[]
[null,{"$f":"\"    \"&Agua!D3","v":"    CUNETAS VERDES"}]
[null,null,null,null,null,null,null,null,null,null,null,null,null,null,"Presupuesto asignado",null,null,0,null,null,null,{"$f":"Agua!D2","v":"CA3"}]
[]
[]
[null,null,{"$f":"Agua!D4","v":"Se refiere a la franja a lo largo de las banquetas (aceras) que tradicionalmente tiene una función de soterrar la infraestructura eléctrica e hidráulica. \n\nEn este caso, se busca que tenga una función de ralentizar, conducir, contener e infiltrar las escorrentías en lluvias extraordinarias, además de acojer vegetación."},null,null,null,null,null,null,null,null,null,null,null,{"$f":"\"          \"&Agua!D7","v":"          metros lineales (promedio ancho de cuneta)"}]
[]
[]
[null,null,null,null,null,null,null,null,null,null,null,null,null,null,{"$f":"\"          \"&Agua!D8","v":"          ¿Se incluye arbolado urbano y plantas?"}]
[]
[]
[null,null,null,null,null,null,null,null,null,null,null,null,null,null,{"$f":"\"          \"&Agua!D12","v":"          ¿Cuál es la pendiente de la cuneta verde?"}]
[]
[]
[]
[null,null,{"$f":"IF(D70=0,\" \",\"Fuente:\")","v":"Fuente:"},{"$f":"Agua!D5","v":"Infografías de soluciones de infraestructura verde. GIZ y SEDATU. Ejemplo de biozanja como solución de gestión alternativa del agua de lluvia en la Ciudad de Mérida.\nhttp://www.consorciodesantiago.org/sites/default/files/anexo_2-funcionalidad_de_los_espacios_verdes.pdf"}]
[]
[]
[]
[null,{"$f":"\"    \"&Agua!E3","v":"    DRENAJE SEPARATIVO"}]
[null,null,null,null,null,null,null,null,null,null,null,null,null,null,"Presupuesto asignado",null,null,0,null,null,null,{"$f":"Agua!E2","v":"CA4"}]
[]
[]
[null,null,{"$f":"Agua!E4","v":"Se refiere a la existencia de conductos independientes para el agua de lluvia y para las aguas servidas que surgen bien de la infraestructuras o de las edificaciones colindantes."},null,null,null,null,null,null,null,null,null,null,null,{"$f":"\"          \"&Agua!E7","v":"          metros lineales conducto para  aguas de lluvia"}]
[]
[]
[null,null,null,null,null,null,null,null,null,null,null,null,null,null,{"$f":"\"          \"&Agua!E8","v":"          metros lineales conducto para aguas negras"}]
[]
[]
[null,null,null,null,null,null,null,null,null,null,null,null,null,null,{"$f":"\"          \"&Agua!E9","v":"          ¿m3 de agua de lluvia que no es contaminada con aguas \n          negras?"}]
[]
[]
[null,null,{"$f":"IF(D87=0,\" \",\"Fuente:\")","v":"Fuente:"},{"$f":"Agua!E5","v":"Manejo de aguas grises y residuales del “Curso de calles e infraestructura Verde del programa CiClim. GIZ, SEDATU y SEMARNAT”."}]
[]
[]
[]
[null,{"$f":"\"    \"&Agua!F3","v":"    HUMEDAL SEMIARTIFICIAL"}]
[null,null,null,null,null,null,null,null,null,null,null,null,null,null,"Presupuesto asignado",null,null,0,null,null,null,{"$f":"Agua!F2","v":"CA5"}]
[]
[]
[null,null,{"$f":"Agua!F4","v":"Se refiere a sistemas acuáticos que replican los procesos de descomposición que ocurren naturalmente en medios lacustres o marinos. \n\nLa estructura más común es un lecho relleno de grava y arena colocado en una superficie impermeable (arcilla o gomembrana) y plantas acuáticas macrófitas cuyas raíces liberan oxígeno y evitan la sedimentación anóxica."},null,null,null,null,null,null,null,null,null,null,null,{"$f":"\"               \"&Agua!F7","v":"               m2"}]
[]
[]
[null,null,null,null,null,null,null,null,null,null,null,null,null,null,{"$f":"\"          \"&Agua!F8","v":"          ¿Incluye especies herbáceas que sirven a polinizadores?"}]
[]
[]
[null,null,null,null,null,null,null,null,null,null,null,null,null,null,{"$f":"\"          \"&Agua!F12","v":"          ¿El humedal tiene una función para la purificación de agua?"}]
[]
[]
[null,null,null,null,null,null,null,null,null,null,null,null,null,null,{"$f":"\"          \"&Agua!F17","v":"          ¿La ubicación del humedal está en constante asoleamiento? "}]
[]
[]
[null,null,null,null,null,null,null,null,null,null,null,null,null,null,{"$f":"\"          \"&Agua!F24","v":"          ¿Qué tipo de especies se eligen en los humedales o riberas \n          de los ríos?"}]
[]
[]
[null,null,null,null,null,null,null,null,null,null,null,null,null,null,{"$f":"\"          \"&Agua!F33","v":"          ¿Los criterios de diseño valoran aspectos estéticos y \n         generan recursos comunitarios con áreas deportivas y \n         culturales ?"}]
[]
[]
[]
[null,null,{"$f":"IF(D114=0,\" \",\"Fuente:\")","v":"Fuente:"},{"$f":"Agua!F5","v":"https://ecotec.unam.mx/ecoteca/humedales-artificiales-2. 20/agosto/2021)\nhttps://www.ipcc-nggip.iges.or.jp/public/2006gl/spanish/pdf/4_Volume4/V4_07_Ch7_Wetlands.pdf"},null,null,null,null,null,null,null,null,null,null,{"$f":"\"          \"&Agua!F40","v":"          ¿La intervención carece de costoso mantenimiento?"}]
[]
[]
[]
[]
[null,{"$f":"\"    \"&Agua!G3","v":"    PAVIMENTOS PERMEABLES"}]
[null,null,null,null,null,null,null,null,null,null,null,null,null,null,"Presupuesto asignado",null,null,0,null,null,null,{"$f":"Agua!G2","v":"CA6"}]
[]
[]
[null,null,{"$f":"Agua!G4","v":"Son pavimentos, continuos o modulares, que se componen de materiales que dejan pasar el agua a su través. Permiten que ésta se infiltre por el terreno o sea captada y retenida en capas subsuperficiales para su posterior reutilización o evacuación.  \n\nEl objetivo de estos sistemas es generar zonas donde el agua se infiltre o se almacene amortiguando la cantidad de agua lluvia precipitada y aumentando los tiempos de concentración de la misma. "},null,null,null,null,null,null,null,null,null,null,null,{"$f":"\"          \"&Agua!G7","v":"          ¿Cuál es % del total del suelo antropizado con pavimento \n         permeable?"}]
[]
[]
[]
[]
[]
[]
[]
[]
[null,null,{"$f":"IF(D132=0,\" \",\"Fuente:\")","v":"Fuente:"},{"$f":"Agua!G5","v":"Legret et al., 1999; EPA,1999."}]
[]
[]
[]
[null,{"$f":"\"    \"&Agua!H3","v":"    POZOS DE ABSORCIÓN/INFILTRACIÓN"}]
[null,null,null,null,null,null,null,null,null,null,null,null,null,null,"Presupuesto asignado",null,null,0,null,null,null,{"$f":"Agua!H2","v":"CA7"}]
[]
[]
[null,null,{"$f":"Agua!H4","v":"Los pozos de absorción permiten que el subsuelo capte la mayor cantidad de agua de lluvia en caso de eventos meteorológicos excepcionales y permite que el subsuelo absorba poco a poco el exceso de agua; su constitución debe ser de materiales pétreos gruesos. \n\nPor lo general es de 1 m de diámetro que conduce el agua a una capa del subsuelo que facilita la infiltración del agua en comparación a superficies impermeables a nivel de calle. \n\nEs posible que haya pozos de absorción para aguas de lluvia y aguas negras o grises."},null,null,null,null,null,null,null,null,null,null,null,{"$f":"\"          \"&Agua!H7","v":"          Número de pozos"}]
[]
[]
[null,null,null,null,null,null,null,null,null,null,null,null,null,null,{"$f":"\"          \"&Agua!H12","v":"          ¿Las dimensiones cumplen con el criterio de diseño que \n          evita la colmatación (ancho menor de 7.5m y profundidad \n           entre 1 -2 m) ?"}]
[]
[]
[]
[]
[]
[]
[null,null,{"$f":"IF(D150=0,\" \",\"Fuente:\")","v":"Fuente:"},{"$f":"Agua!H5","v":"Curso de calles e infraestructura Verde del programa CiClim. GIZ, SEDATU y SEMARNAT\nhttps://www.canaldeisabelsegunda.es/documents/20143/79037/2016_Normas_Redes_Saneamiento.pdf/e1461e6b-3e64-8356-2b8f-05ee9845c4d8"}]
[]
[]
[]
[null,{"$f":"\"    \"&Agua!I3","v":"     JARDINERAS FILTRANTES"}]
[null,null,null,null,null,null,null,null,null,null,null,null,null,null,"Presupuesto asignado",null,null,0,null,null,null,{"$f":"Agua!I2","v":"CA8"}]
[]
[]
[null,null,{"$f":"Agua!I4","v":"Las jardineras filtrantes  son sistemas de absorción y filtrado de aguas pluviales. Consiste en una depresión o pozo relleno con distintas capas de material filtrante (piedras porosas de diferentes granulometría), encima de las cuales se planta un jardín. \n\nEste sistema permite que el agua de lluvia fluya a través de las superficies impermeables como pavimentos, azoteas, banquetas para ser absorbida, filtrada y regresada al acuífero. \n\nEl jardín infiltrante cumple varios propósitos. Por un lado, evita las inundaciones que se generan cuando el agua sobrepasa la capacidad de drenaje de una ciudad: y por otro lado, evita que el agua se estanque y se acumule en depresiones impermeables y permite que se filtre hacia el subsuelo y se recargue el acuífero."},null,null,null,null,null,null,null,null,null,null,null,{"$f":"\"          \"&Agua!I7","v":"          Superficie aproximada (m2)"}]
[]
[null,null,null,null,null,null,null,null,null,null,null,null,null,null,{"$f":"\"          \"&Agua!I8","v":"          "}]
[null,null,null,null,null,null,null,null,null,null,null,null,null,null,{"$f":"\"          \"&Agua!I12","v":"          ¿Incluye especies vegetales, arbustos y/o herbaceas que \n          resisten al encharcamiento y protége a los polinizadores? "}]
[]
[]
[]
[]
[]
[]
[]
[]
[]
[null,null,{"$f":"IF(D171=0,\" \",\"Fuente:\")","v":"Fuente:"},{"$f":"Agua!I5","v":"Asimilado a los Jardines de lluvia de: 1) “Catalogación de las NBS implementadas y previstas en Vitoria-Gasteiz”, 2) Jardines para infiltración de “Curso de calles e infraestructura Verde del programa CiClim. GIZ, SEDATU y SEMARNAT”.\nhttp://sudsostenible.com/elementos-de-una-calle-verde-el-arbolado/"}]
[]
[]
[]
[null,{"$f":"\"    \"&Agua!J3","v":"    "}]
[]
[]
[]
[null,null,null,null,null,null,null,null,null,null,null,null,null,null,{"$f":"\"          \"&Agua!J7","v":"          "}]
[]
[]
[null,null,null,null,null,null,null,null,null,null,null,null,null,null,{"$f":"\"          \"&Agua!J8","v":"          "}]
[]
[]
[]
[]
[]
[]
[null,null,{"$f":"IF(D189=0,\" \",\"Fuente:\")","v":" "}]

{"sheet":"Agua","index":10,"n_rows":46,"n_cols":9,"rows_kept":46,"cut":false,"hidden":true,"merged":[]}
["Eje","Agua","Agua","Agua","Agua","Agua","Agua","Agua","Agua"]
["Código","CA1","CA2","CA3","CA4","CA5","CA6","CA7","CA8"]
["Componentes","BIODIGESTORES","PRESAS FILTRANTES","CUNETAS VERDES","DRENAJE SEPARATIVO","HUMEDAL SEMIARTIFICIAL","PAVIMENTOS PERMEABLES","POZOS DE ABSORCIÓN/INFILTRACIÓN"," JARDINERAS FILTRANTES"]
["Descripción","Se refiere a un contenedor cerrado de forma hermética que contiene residuos orgánicos de origen vegetal o animal para generar biogas con trazas de otros gases como fuente de energía. ","Se refiere a la acumulación de tierras/piedra/arena anexa a las las banquetas (aceras) que tiene por objeto retener sólidos y aumentar la infiltración de un cauce proximo a la infraestructura.","Se refiere a la franja a lo largo de las banquetas (aceras) que tradicionalmente tiene una función de soterrar la infraestructura eléctrica e hidráulica. \n\nEn este caso, se busca que tenga una función de ralentizar, conducir, contener e infiltrar las escorrentías en lluvias extraordinarias, además de acojer vegetación.","Se refiere a la existencia de conductos independientes para el agua de lluvia y para las aguas servidas que surgen bien de la infraestructuras o de las edificaciones colindantes.","Se refiere a sistemas acuáticos que replican los procesos de descomposición que ocurren naturalmente en medios lacustres o marinos. \n\nLa estructura más común es un lecho relleno de grava y arena colocado en una superficie impermeable (arcilla o gomembrana) y plantas acuáticas macrófitas cuyas raíces liberan oxígeno y evitan la sedimentación anóxica.","Son pavimentos, continuos o modulares, que se componen de materiales que dejan pasar el agua a su través. Permiten que ésta se infiltre por el terreno o sea captada y retenida en capas subsuperficiales para su posterior reutilización o evacuación.  \n\nEl objetivo de estos sistemas es generar zonas donde el agua se infiltre o se almacene amortiguando la cantidad de agua lluvia precipitada y aumentando los tiempos de concentración de la misma. ","Los pozos de absorción permiten que el subsuelo capte la mayor cantidad de agua de lluvia en caso de eventos meteorológicos excepcionales y permite que el subsuelo absorba poco a poco el exceso de agua; su constitución debe ser de materiales pétreos gruesos. \n\nPor lo general es de 1 m de diámetro que conduce el agua a una capa del subsuelo que facilita la infiltración del agua en comparación a superficies impermeables a nivel de calle. \n\nEs posible que haya pozos de absorción para aguas de lluvia y aguas negras o grises.","Las jardineras filtrantes  son sistemas de absorción y filtrado de aguas pluviales. Consiste en una depresión o pozo relleno con distintas capas de material filtrante (piedras porosas de diferentes granulometría), encima de las cuales se planta un jardín. \n\nEste sistema permite que el agua de lluvia fluya a través de las superficies impermeables como pavimentos, azoteas, banquetas para ser absorbida, filtrada y regresada al acuífero. \n\nEl jardín infiltrante cumple varios propósitos. Por un lado, evita las inundaciones que se generan cuando el agua sobrepasa la capacidad de drenaje de una ciudad: y por otro lado, evita que el agua se estanque y se acumule en depresiones impermeables y permite que se filtre hacia el subsuelo y se recargue el acuífero."]
["Referencia","Ortiz-Moreno, J. A., Masera-Cerutti, O., & Fuentes-Gutierrez, A. F. (2014). La ecotecnología en México (Primera ed., p. 126). México, D. F.: Imagia. https://ecotec.unam.mx/ecoteca/biodigestores-2\nhttp://www.scielo.org.mx/scielo.php?script=sci_arttext&pid=S1870-57662018000200235\n","El anillo verde Interior. Hacia una infraestructura Verde Urbana en Vitoria-Gasteiz. Ayuntamiento de Vitoria-Gasteiz\nhttps://silo.tips/queue/cultura-y-manejo-adecuado-del-agua?&queue_id=-1&v=1632729959&u=MzEuNC4yNDcuMjI4","Infografías de soluciones de infraestructura verde. GIZ y SEDATU. Ejemplo de biozanja como solución de gestión alternativa del agua de lluvia en la Ciudad de Mérida.\nhttp://www.consorciodesantiago.org/sites/default/files/anexo_2-funcionalidad_de_los_espacios_verdes.pdf","Manejo de aguas grises y residuales del “Curso de calles e infraestructura Verde del programa CiClim. GIZ, SEDATU y SEMARNAT”.","https://ecotec.unam.mx/ecoteca/humedales-artificiales-2. 20/agosto/2021)\nhttps://www.ipcc-nggip.iges.or.jp/public/2006gl/spanish/pdf/4_Volume4/V4_07_Ch7_Wetlands.pdf","Legret et al., 1999; EPA,1999.","Curso de calles e infraestructura Verde del programa CiClim. GIZ, SEDATU y SEMARNAT\nhttps://www.canaldeisabelsegunda.es/documents/20143/79037/2016_Normas_Redes_Saneamiento.pdf/e1461e6b-3e64-8356-2b8f-05ee9845c4d8","Asimilado a los Jardines de lluvia de: 1) “Catalogación de las NBS implementadas y previstas en Vitoria-Gasteiz”, 2) Jardines para infiltración de “Curso de calles e infraestructura Verde del programa CiClim. GIZ, SEDATU y SEMARNAT”.\nhttp://sudsostenible.com/elementos-de-una-calle-verde-el-arbolado/"]
["Pregunta 1","¿El proyecto incluye instalación de biodigestor?","¿El proyecto incluye presas filtrantes?","¿El proyecto incluye cunetas verdes?","¿El proyecto cuenta con drenaje separativo?","¿El proyecto cuenta con humedal artificial?","¿El proyecto cuenta con Pavimentos Permeables?","¿El proyecto cuenta con pozos de absorción?","¿Incluye jardineras filtrantes,zanjas o pozos de infiltración?"]
["Pregunta 1SI","Número de biodigestores","Superficie aproximada (m2)","metros lineales (promedio ancho de cuneta)","metros lineales conducto para  aguas de lluvia","m2","¿Cuál es % del total del suelo antropizado con pavimento \n         permeable?","Número de pozos","Superficie aproximada (m2)"]
[null,"Capacidad de los biodigestores (aproximada)",null,"¿Se incluye arbolado urbano y plantas?","metros lineales conducto para aguas negras","¿Incluye especies herbáceas que sirven a polinizadores?","0"]
[null,null,null,null,"¿m3 de agua de lluvia que no es contaminada con aguas \n          negras?",null," <30%"]
[null,null,null,null,null,null,"31% - 49%"]
[null,null,null,null,null,null,">50%"]
["Pregunta Q1","El biodigestor contiene algún sistema de filtración del agua \n           restante que evite la contaminación de los acuíferos? \n          (humedal artificial, plantas filtrantes,…)","¿El área de la presa es protegida (cerca y tapa) evitando la \n          contaminación por agentes externos \n          (hojas, animales, etc.)?","¿Cuál es la pendiente de la cuneta verde?",null,"¿El humedal tiene una función para la purificación de agua?",null,"¿Las dimensiones cumplen con el criterio de diseño que \n          evita la colmatación (ancho menor de 7.5m y profundidad \n           entre 1 -2 m) ?","¿Incluye especies vegetales, arbustos y/o herbaceas que \n          resisten al encharcamiento y protége a los polinizadores? "]
["RQ1","SI","SI","entre \n1 - 6 %",null,"SI",null,"SI","SI"]
["RQ2","NO","NO","> 6%",null,"NO",null,"NO","NO"]
["QSI",1,1,1,null,1,null,1,1]
["QNO",0.5,0.5,0.5,null,0.5,null,0.5,0.5]
["Adaptación/Mitigación",null,null,null,null,"¿La ubicación del humedal está en constante asoleamiento? "]
["Adaptación/Mitigación",null,null,null,null,"SI"]
["Adaptación/Mitigación",null,null,null,null,"NO"]
[null,null,null,null,null,"NO SE"]
["Adaptación/Mitigación",null,null,null,null,1.25]
["Adaptación/Mitigación",null,null,null,null,0.75]
[null,null,null,null,null,1]
["Ambientales ",null,null,null,null,"¿Qué tipo de especies se eligen en los humedales o riberas \n          de los ríos?"]
["Ambientales ",null,null,null,null,"Nativas"]
["Ambientales ",null,null,null,null,"No Nativas"]
["Ambientales ",null,null,null,null,"Ambas"]
["Ambientales ",null,null,null,null,"No sé"]
["Ambientales ",null,null,null,null,1.25]
["Ambientales ",null,null,null,null,0.75]
["Ambientales ",null,null,null,null,1.05]
["Ambientales ",null,null,null,null,1]
["Sociales",null,null,null,null,"¿Los criterios de diseño valoran aspectos estéticos y \n         generan recursos comunitarios con áreas deportivas y \n         culturales ?"]
["Sociales",null,null,null,null,"SI"]
["Sociales",null,null,null,null,"NO"]
["Sociales",null,null,null,null,"NO SE"]
["Sociales",null,null,null,null,1.25]
["Sociales",null,null,null,null,0.75]
[null,null,null,null,null,1]
["Económicos",null,null,null,null,"¿La intervención carece de costoso mantenimiento?"]
["Económicos",null,null,null,null,"SI"]
["Económicos",null,null,null,null,"NO"]
[null,null,null,null,null,"NO SE"]
["Económicos",null,null,null,null,1.25]
["Económicos",null,null,null,null,0.75]
[null,null,null,null,null,1]

{"sheet":"RegistroA","index":11,"n_rows":20,"n_cols":72,"rows_kept":20,"cut":false,"hidden":true,"merged":[]}
["Código","Componentes","Presupuesto","Pregunta 1","Respuesta","Valor ","Pregunta 1SI","Dato 1","Pregunta 2SI","Dato 2","Pregunta 3SI","Dato 3",null,null,"Pregunta clave","Dato Q","Dato q1","Climático","β1","Ambientales","β2","Sociales ","β3","Económicos","β4",null,1,2,3,4,5,6,7,8,9,10,11,12,13,14,15,16,17,18,19,20,null,"Suma",null,null,null,1,2,3,4,5,6,7,8,9,10,11,12,13,14,15,16,17,18,19,20,"Suma"]
["CA1",{"$f":"Agua!B3","v":"BIODIGESTORES"},{"$f":"'2a. Componentes Agua'!R24","v":0},{"$f":"Agua!B6","v":"¿El proyecto incluye instalación de biodigestor?"},"NO",{"$f":"IF(E2=\"NO\",0,1)","v":0},{"$f":"Agua!B7","v":"Número de biodigestores"},{"$f":"'2a. Componentes Agua'!V27","v":0},{"$f":"Agua!B8","v":"Capacidad de los biodigestores (aproximada)"},{"$f":"'2a. Componentes Agua'!V30","v":0},null,null,null,null,{"$f":"Agua!B12","v":"El biodigestor contiene algún sistema de filtración del agua \n           restante que evite la contaminación de los acuíferos? \n          (humedal artificial, plantas filtrantes,…)"},{"$f":"'2a. Componentes Agua'!V33","v":0},{"$f":"IF(P2=0,1,IF(P2=\"SI\",Agua!B15,Agua!B16))","v":1},1,1,1,1,1,1,1,1,null,{"$f":"IF($E2=\"SI\",VLOOKUP((CONCATENATE($A2,AA$1)),'Impactos Data'!$F$2:$G$521,2,FALSE),0)","v":0},{"$f":"IF($E2=\"SI\",VLOOKUP((CONCATENATE($A2,AB$1)),'Impactos Data'!$F$2:$G$521,2,FALSE),0)","v":0},{"$f":"IF($E2=\"SI\",VLOOKUP((CONCATENATE($A2,AC$1)),'Impactos Data'!$F$2:$G$521,2,FALSE),0)","v":0},{"$f":"IF($E2=\"SI\",VLOOKUP((CONCATENATE($A2,AD$1)),'Impactos Data'!$F$2:$G$521,2,FALSE),0)","v":0},{"$f":"IF($E2=\"SI\",VLOOKUP((CONCATENATE($A2,AE$1)),'Impactos Data'!$F$2:$G$521,2,FALSE),0)","v":0},{"$f":"IF($E2=\"SI\",VLOOKUP((CONCATENATE($A2,AF$1)),'Impactos Data'!$F$2:$G$521,2,FALSE),0)","v":0},{"$f":"IF($E2=\"SI\",VLOOKUP((CONCATENATE($A2,AG$1)),'Impactos Data'!$F$2:$G$521,2,FALSE),0)","v":0},{"$f":"IF($E2=\"SI\",VLOOKUP((CONCATENATE($A2,AH$1)),'Impactos Data'!$F$2:$G$521,2,FALSE),0)","v":0},{"$f":"IF($E2=\"SI\",VLOOKUP((CONCATENATE($A2,AI$1)),'Impactos Data'!$F$2:$G$521,2,FALSE),0)","v":0},{"$f":"IF($E2=\"SI\",VLOOKUP((CONCATENATE($A2,AJ$1)),'Impactos Data'!$F$2:$G$521,2,FALSE),0)","v":0},{"$f":"IF($E2=\"SI\",VLOOKUP((CONCATENATE($A2,AK$1)),'Impactos Data'!$F$2:$G$521,2,FALSE),0)","v":0},{"$f":"IF($E2=\"SI\",VLOOKUP((CONCATENATE($A2,AL$1)),'Impactos Data'!$F$2:$G$521,2,FALSE),0)","v":0},{"$f":"IF($E2=\"SI\",VLOOKUP((CONCATENATE($A2,AM$1)),'Impactos Data'!$F$2:$G$521,2,FALSE),0)","v":0},{"$f":"IF($E2=\"SI\",VLOOKUP((CONCATENATE($A2,AN$1)),'Impactos Data'!$F$2:$G$521,2,FALSE),0)","v":0},{"$f":"IF($E2=\"SI\",VLOOKUP((CONCATENATE($A2,AO$1)),'Impactos Data'!$F$2:$G$521,2,FALSE),0)","v":0},{"$f":"IF($E2=\"SI\",VLOOKUP((CONCATENATE($A2,AP$1)),'Impactos Data'!$F$2:$G$521,2,FALSE),0)","v":0},{"$f":"IF($E2=\"SI\",VLOOKUP((CONCATENATE($A2,AQ$1)),'Impactos Data'!$F$2:$G$521,2,FALSE),0)","v":0},{"$f":"IF($E2=\"SI\",VLOOKUP((CONCATENATE($A2,AR$1)),'Impactos Data'!$F$2:$G$521,2,FALSE),0)","v":0},{"$f":"IF($E2=\"SI\",VLOOKUP((CONCATENATE($A2,AS$1)),'Impactos Data'!$F$2:$G$521,2,FALSE),0)","v":0},{"$f":"IF($E2=\"SI\",VLOOKUP((CONCATENATE($A2,AT$1)),'Impactos Data'!$F$2:$G$521,2,FALSE),0)","v":0},null,{"$f":"SUM(AA2:AT2)","v":0},null,null,null,{"$f":"AA2*$Q2*$S2","v":0},0,{"$f":"AC2*$Q2*$S2","v":0},0,0,0,{"$f":"AG2*$Q2*$S2","v":0},{"$f":"AH2*$Q2*$U2","v":0},{"$f":"AI2*$Q2*$U2","v":0},0,0,0,0,{"$f":"AN2*$Q2*$W2","v":0},{"$f":"AO2*$Q2*$W2","v":0},0,0,0,{"$f":"AS2*$Q2*$Y2","v":0},{"$f":"AT2*$Q2*$Y2","v":0},{"$f":"SUM(AZ2:BS2)","v":0}]
["CA2",{"$f":"Agua!C3","v":"PRESAS FILTRANTES"},{"$f":"'2a. Componentes Agua'!R42","v":0},{"$f":"Agua!C6","v":"¿El proyecto incluye presas filtrantes?"},"NO",{"$f":"IF(E3=\"NO\",0,1)","v":0},{"$f":"Agua!C7","v":"Superficie aproximada (m2)"},{"$f":"'2a. Componentes Agua'!V45","v":0},null,null,null,null,null,null,{"$f":"Agua!C12","v":"¿El área de la presa es protegida (cerca y tapa) evitando la \n          contaminación por agentes externos \n          (hojas, animales, etc.)?"},{"$f":"'2a. Componentes Agua'!V48","v":0},{"$f":"IF(P3=0,1,IF(P3=\"SI\",Agua!C15,Agua!C16))","v":1},1,1,1,1,1,1,1,1,null,{"$f":"IF($E3=\"SI\",VLOOKUP((CONCATENATE($A3,AA$1)),'Impactos Data'!$F$2:$G$521,2,FALSE),0)","v":0},{"$f":"IF($E3=\"SI\",VLOOKUP((CONCATENATE($A3,AB$1)),'Impactos Data'!$F$2:$G$521,2,FALSE),0)","v":0},{"$f":"IF($E3=\"SI\",VLOOKUP((CONCATENATE($A3,AC$1)),'Impactos Data'!$F$2:$G$521,2,FALSE),0)","v":0},{"$f":"IF($E3=\"SI\",VLOOKUP((CONCATENATE($A3,AD$1)),'Impactos Data'!$F$2:$G$521,2,FALSE),0)","v":0},{"$f":"IF($E3=\"SI\",VLOOKUP((CONCATENATE($A3,AE$1)),'Impactos Data'!$F$2:$G$521,2,FALSE),0)","v":0},{"$f":"IF($E3=\"SI\",VLOOKUP((CONCATENATE($A3,AF$1)),'Impactos Data'!$F$2:$G$521,2,FALSE),0)","v":0},{"$f":"IF($E3=\"SI\",VLOOKUP((CONCATENATE($A3,AG$1)),'Impactos Data'!$F$2:$G$521,2,FALSE),0)","v":0},{"$f":"IF($E3=\"SI\",VLOOKUP((CONCATENATE($A3,AH$1)),'Impactos Data'!$F$2:$G$521,2,FALSE),0)","v":0},{"$f":"IF($E3=\"SI\",VLOOKUP((CONCATENATE($A3,AI$1)),'Impactos Data'!$F$2:$G$521,2,FALSE),0)","v":0},{"$f":"IF($E3=\"SI\",VLOOKUP((CONCATENATE($A3,AJ$1)),'Impactos Data'!$F$2:$G$521,2,FALSE),0)","v":0},{"$f":"IF($E3=\"SI\",VLOOKUP((CONCATENATE($A3,AK$1)),'Impactos Data'!$F$2:$G$521,2,FALSE),0)","v":0},{"$f":"IF($E3=\"SI\",VLOOKUP((CONCATENATE($A3,AL$1)),'Impactos Data'!$F$2:$G$521,2,FALSE),0)","v":0},{"$f":"IF($E3=\"SI\",VLOOKUP((CONCATENATE($A3,AM$1)),'Impactos Data'!$F$2:$G$521,2,FALSE),0)","v":0},{"$f":"IF($E3=\"SI\",VLOOKUP((CONCATENATE($A3,AN$1)),'Impactos Data'!$F$2:$G$521,2,FALSE),0)","v":0},{"$f":"IF($E3=\"SI\",VLOOKUP((CONCATENATE($A3,AO$1)),'Impactos Data'!$F$2:$G$521,2,FALSE),0)","v":0},{"$f":"IF($E3=\"SI\",VLOOKUP((CONCATENATE($A3,AP$1)),'Impactos Data'!$F$2:$G$521,2,FALSE),0)","v":0},{"$f":"IF($E3=\"SI\",VLOOKUP((CONCATENATE($A3,AQ$1)),'Impactos Data'!$F$2:$G$521,2,FALSE),0)","v":0},{"$f":"IF($E3=\"SI\",VLOOKUP((CONCATENATE($A3,AR$1)),'Impactos Data'!$F$2:$G$521,2,FALSE),0)","v":0},{"$f":"IF($E3=\"SI\",VLOOKUP((CONCATENATE($A3,AS$1)),'Impactos Data'!$F$2:$G$521,2,FALSE),0)","v":0},{"$f":"IF($E3=\"SI\",VLOOKUP((CONCATENATE($A3,AT$1)),'Impactos Data'!$F$2:$G$521,2,FALSE),0)","v":0},null,{"$f":"SUM(AA3:AT3)","v":0},null,null,null,0,0,0,0,0,0,0,{"$f":"AH3*$Q3*$U3","v":0},{"$f":"AI3*$Q3*$U3","v":0},{"$f":"AJ3*$Q3*$U3","v":0},{"$f":"AK3*$Q3*$U3","v":0},{"$f":"AL3*$Q3*$U3","v":0},{"$f":"AM3*$Q3*$U3","v":0},{"$f":"AN3*$Q3*$W3","v":0},0,0,0,0,{"$f":"AS3*$Q3*$Y3","v":0},{"$f":"AT3*$Q3*$Y3","v":0},{"$f":"SUM(AZ3:BS3)","v":0}]
["CA3",{"$f":"Agua!D3","v":"CUNETAS VERDES"},{"$f":"'2a. Componentes Agua'!R57","v":0},{"$f":"Agua!D6","v":"¿El proyecto incluye cunetas verdes?"},"NO",0,{"$f":"Agua!D7","v":"metros lineales (promedio ancho de cuneta)"},{"$f":"'2a. Componentes Agua'!V60","v":0},null,null,null,null,null,null,{"$f":"Agua!D12","v":"¿Cuál es la pendiente de la cuneta verde?"},{"$f":"'2a. Componentes Agua'!V66","v":0},{"$f":"IF(P4=0,1,IF(P4=Agua!D13,Agua!D15,Agua!D16))","v":1},1,1,1,1,1,1,1,1,null,{"$f":"IF($E4=\"SI\",VLOOKUP((CONCATENATE($A4,AA$1)),'Impactos Data'!$F$2:$G$521,2,FALSE),0)","v":0},{"$f":"IF($E4=\"SI\",VLOOKUP((CONCATENATE($A4,AB$1)),'Impactos Data'!$F$2:$G$521,2,FALSE),0)","v":0},{"$f":"IF($E4=\"SI\",VLOOKUP((CONCATENATE($A4,AC$1)),'Impactos Data'!$F$2:$G$521,2,FALSE),0)","v":0},{"$f":"IF($E4=\"SI\",VLOOKUP((CONCATENATE($A4,AD$1)),'Impactos Data'!$F$2:$G$521,2,FALSE),0)","v":0},{"$f":"IF($E4=\"SI\",VLOOKUP((CONCATENATE($A4,AE$1)),'Impactos Data'!$F$2:$G$521,2,FALSE),0)","v":0},{"$f":"IF($E4=\"SI\",VLOOKUP((CONCATENATE($A4,AF$1)),'Impactos Data'!$F$2:$G$521,2,FALSE),0)","v":0},{"$f":"IF($E4=\"SI\",VLOOKUP((CONCATENATE($A4,AG$1)),'Impactos Data'!$F$2:$G$521,2,FALSE),0)","v":0},{"$f":"IF($E4=\"SI\",VLOOKUP((CONCATENATE($A4,AH$1)),'Impactos Data'!$F$2:$G$521,2,FALSE),0)","v":0},{"$f":"IF($E4=\"SI\",VLOOKUP((CONCATENATE($A4,AI$1)),'Impactos Data'!$F$2:$G$521,2,FALSE),0)","v":0},{"$f":"IF($E4=\"SI\",VLOOKUP((CONCATENATE($A4,AJ$1)),'Impactos Data'!$F$2:$G$521,2,FALSE),0)","v":0},{"$f":"IF($E4=\"SI\",VLOOKUP((CONCATENATE($A4,AK$1)),'Impactos Data'!$F$2:$G$521,2,FALSE),0)","v":0},{"$f":"IF($E4=\"SI\",VLOOKUP((CONCATENATE($A4,AL$1)),'Impactos Data'!$F$2:$G$521,2,FALSE),0)","v":0},{"$f":"IF($E4=\"SI\",VLOOKUP((CONCATENATE($A4,AM$1)),'Impactos Data'!$F$2:$G$521,2,FALSE),0)","v":0},{"$f":"IF($E4=\"SI\",VLOOKUP((CONCATENATE($A4,AN$1)),'Impactos Data'!$F$2:$G$521,2,FALSE),0)","v":0},{"$f":"IF($E4=\"SI\",VLOOKUP((CONCATENATE($A4,AO$1)),'Impactos Data'!$F$2:$G$521,2,FALSE),0)","v":0},{"$f":"IF($E4=\"SI\",VLOOKUP((CONCATENATE($A4,AP$1)),'Impactos Data'!$F$2:$G$521,2,FALSE),0)","v":0},{"$f":"IF($E4=\"SI\",VLOOKUP((CONCATENATE($A4,AQ$1)),'Impactos Data'!$F$2:$G$521,2,FALSE),0)","v":0},{"$f":"IF($E4=\"SI\",VLOOKUP((CONCATENATE($A4,AR$1)),'Impactos Data'!$F$2:$G$521,2,FALSE),0)","v":0},{"$f":"IF($E4=\"SI\",VLOOKUP((CONCATENATE($A4,AS$1)),'Impactos Data'!$F$2:$G$521,2,FALSE),0)","v":0},{"$f":"IF($E4=\"SI\",VLOOKUP((CONCATENATE($A4,AT$1)),'Impactos Data'!$F$2:$G$521,2,FALSE),0)","v":0},null,{"$f":"SUM(AA4:AT4)","v":0},null,null,null,0,0,0,0,0,0,0,0,0,0,0,0,0,0,0,0,0,0,0,0,0]
["CA4",{"$f":"Agua!E3","v":"DRENAJE SEPARATIVO"},{"$f":"'2a. Componentes Agua'!R75","v":0},{"$f":"Agua!E6","v":"¿El proyecto cuenta con drenaje separativo?"},"NO",0,"metros lineales conducto para  aguas de lluvia",{"$f":"'2a. Componentes Agua'!V81","v":0},"ml conducto para aguas negras",{"$f":"'2a. Componentes Agua'!V84","v":0},null,null,null,null,"-","-",1,1,1,1,1,1,1,1,1,null,{"$f":"IF($E5=\"SI\",VLOOKUP((CONCATENATE($A5,AA$1)),'Impactos Data'!$F$2:$G$521,2,FALSE),0)","v":0},{"$f":"IF($E5=\"SI\",VLOOKUP((CONCATENATE($A5,AB$1)),'Impactos Data'!$F$2:$G$521,2,FALSE),0)","v":0},{"$f":"IF($E5=\"SI\",VLOOKUP((CONCATENATE($A5,AC$1)),'Impactos Data'!$F$2:$G$521,2,FALSE),0)","v":0},{"$f":"IF($E5=\"SI\",VLOOKUP((CONCATENATE($A5,AD$1)),'Impactos Data'!$F$2:$G$521,2,FALSE),0)","v":0},{"$f":"IF($E5=\"SI\",VLOOKUP((CONCATENATE($A5,AE$1)),'Impactos Data'!$F$2:$G$521,2,FALSE),0)","v":0},{"$f":"IF($E5=\"SI\",VLOOKUP((CONCATENATE($A5,AF$1)),'Impactos Data'!$F$2:$G$521,2,FALSE),0)","v":0},{"$f":"IF($E5=\"SI\",VLOOKUP((CONCATENATE($A5,AG$1)),'Impactos Data'!$F$2:$G$521,2,FALSE),0)","v":0},{"$f":"IF($E5=\"SI\",VLOOKUP((CONCATENATE($A5,AH$1)),'Impactos Data'!$F$2:$G$521,2,FALSE),0)","v":0},{"$f":"IF($E5=\"SI\",VLOOKUP((CONCATENATE($A5,AI$1)),'Impactos Data'!$F$2:$G$521,2,FALSE),0)","v":0},{"$f":"IF($E5=\"SI\",VLOOKUP((CONCATENATE($A5,AJ$1)),'Impactos Data'!$F$2:$G$521,2,FALSE),0)","v":0},{"$f":"IF($E5=\"SI\",VLOOKUP((CONCATENATE($A5,AK$1)),'Impactos Data'!$F$2:$G$521,2,FALSE),0)","v":0},{"$f":"IF($E5=\"SI\",VLOOKUP((CONCATENATE($A5,AL$1)),'Impactos Data'!$F$2:$G$521,2,FALSE),0)","v":0},{"$f":"IF($E5=\"SI\",VLOOKUP((CONCATENATE($A5,AM$1)),'Impactos Data'!$F$2:$G$521,2,FALSE),0)","v":0},{"$f":"IF($E5=\"SI\",VLOOKUP((CONCATENATE($A5,AN$1)),'Impactos Data'!$F$2:$G$521,2,FALSE),0)","v":0},{"$f":"IF($E5=\"SI\",VLOOKUP((CONCATENATE($A5,AO$1)),'Impactos Data'!$F$2:$G$521,2,FALSE),0)","v":0},{"$f":"IF($E5=\"SI\",VLOOKUP((CONCATENATE($A5,AP$1)),'Impactos Data'!$F$2:$G$521,2,FALSE),0)","v":0},{"$f":"IF($E5=\"SI\",VLOOKUP((CONCATENATE($A5,AQ$1)),'Impactos Data'!$F$2:$G$521,2,FALSE),0)","v":0},{"$f":"IF($E5=\"SI\",VLOOKUP((CONCATENATE($A5,AR$1)),'Impactos Data'!$F$2:$G$521,2,FALSE),0)","v":0},{"$f":"IF($E5=\"SI\",VLOOKUP((CONCATENATE($A5,AS$1)),'Impactos Data'!$F$2:$G$521,2,FALSE),0)","v":0},{"$f":"IF($E5=\"SI\",VLOOKUP((CONCATENATE($A5,AT$1)),'Impactos Data'!$F$2:$G$521,2,FALSE),0)","v":0},null,{"$f":"SUM(AA5:AT5)","v":0},null,null,null,0,0,0,0,0,0,0,0,0,0,0,0,0,0,0,0,0,0,0,0,0]
["CA5",{"$f":"Agua!F3","v":"HUMEDAL SEMIARTIFICIAL"},{"$f":"'2a. Componentes Agua'!R92","v":0},{"$f":"Agua!F6","v":"¿El proyecto cuenta con humedal artificial?"},"NO",0,{"$f":"Agua!F7","v":"m2"},{"$f":"'2a. Componentes Agua'!V95","v":0},null,null,null,null,null,null,{"$f":"Agua!F12","v":"¿El humedal tiene una función para la purificación de agua?"},{"$f":"'2a. Componentes Agua'!V101","v":0},{"$f":"IF(P6=0,1,IF(P6=\"SI\",Agua!F15,Agua!F16))","v":1},{"$f":"'2a. Componentes Agua'!V104","v":0},{"$f":"IF(R6=0,1,IF(R6=Agua!F18,Agua!F21,IF(R6=Agua!F19,Agua!F22,Agua!F23)))","v":1},{"$f":"'2a. Componentes Agua'!V107","v":0},{"$f":"IF(T6=0,1,IF(T6=Agua!F25,Agua!F29,IF(T6=Agua!F26,Agua!F30,Agua!F32)))","v":1},{"$f":"'2a. Componentes Agua'!V110","v":0},{"$f":"IF(V6=0,1,IF(V6=Agua!F34,Agua!F37,IF(V6=Agua!F35,Agua!F38,Agua!F39)))","v":1},{"$f":"'2a. Componentes Agua'!V114","v":0},{"$f":"IF(X6=0,1,IF(X6=Agua!F41,Agua!F44,IF(X6=Agua!F42,Agua!F45,Agua!F46)))","v":1},null,{"$f":"IF($E6=\"SI\",VLOOKUP((CONCATENATE($A6,AA$1)),'Impactos Data'!$F$2:$G$521,2,FALSE),0)","v":0},{"$f":"IF($E6=\"SI\",VLOOKUP((CONCATENATE($A6,AB$1)),'Impactos Data'!$F$2:$G$521,2,FALSE),0)","v":0},{"$f":"IF($E6=\"SI\",VLOOKUP((CONCATENATE($A6,AC$1)),'Impactos Data'!$F$2:$G$521,2,FALSE),0)","v":0},{"$f":"IF($E6=\"SI\",VLOOKUP((CONCATENATE($A6,AD$1)),'Impactos Data'!$F$2:$G$521,2,FALSE),0)","v":0},{"$f":"IF($E6=\"SI\",VLOOKUP((CONCATENATE($A6,AE$1)),'Impactos Data'!$F$2:$G$521,2,FALSE),0)","v":0},{"$f":"IF($E6=\"SI\",VLOOKUP((CONCATENATE($A6,AF$1)),'Impactos Data'!$F$2:$G$521,2,FALSE),0)","v":0},{"$f":"IF($E6=\"SI\",VLOOKUP((CONCATENATE($A6,AG$1)),'Impactos Data'!$F$2:$G$521,2,FALSE),0)","v":0},{"$f":"IF($E6=\"SI\",VLOOKUP((CONCATENATE($A6,AH$1)),'Impactos Data'!$F$2:$G$521,2,FALSE),0)","v":0},{"$f":"IF($E6=\"SI\",VLOOKUP((CONCATENATE($A6,AI$1)),'Impactos Data'!$F$2:$G$521,2,FALSE),0)","v":0},{"$f":"IF($E6=\"SI\",VLOOKUP((CONCATENATE($A6,AJ$1)),'Impactos Data'!$F$2:$G$521,2,FALSE),0)","v":0},{"$f":"IF($E6=\"SI\",VLOOKUP((CONCATENATE($A6,AK$1)),'Impactos Data'!$F$2:$G$521,2,FALSE),0)","v":0},{"$f":"IF($E6=\"SI\",VLOOKUP((CONCATENATE($A6,AL$1)),'Impactos Data'!$F$2:$G$521,2,FALSE),0)","v":0},{"$f":"IF($E6=\"SI\",VLOOKUP((CONCATENATE($A6,AM$1)),'Impactos Data'!$F$2:$G$521,2,FALSE),0)","v":0},{"$f":"IF($E6=\"SI\",VLOOKUP((CONCATENATE($A6,AN$1)),'Impactos Data'!$F$2:$G$521,2,FALSE),0)","v":0},{"$f":"IF($E6=\"SI\",VLOOKUP((CONCATENATE($A6,AO$1)),'Impactos Data'!$F$2:$G$521,2,FALSE),0)","v":0},{"$f":"IF($E6=\"SI\",VLOOKUP((CONCATENATE($A6,AP$1)),'Impactos Data'!$F$2:$G$521,2,FALSE),0)","v":0},{"$f":"IF($E6=\"SI\",VLOOKUP((CONCATENATE($A6,AQ$1)),'Impactos Data'!$F$2:$G$521,2,FALSE),0)","v":0},{"$f":"IF($E6=\"SI\",VLOOKUP((CONCATENATE($A6,AR$1)),'Impactos Data'!$F$2:$G$521,2,FALSE),0)","v":0},{"$f":"IF($E6=\"SI\",VLOOKUP((CONCATENATE($A6,AS$1)),'Impactos Data'!$F$2:$G$521,2,FALSE),0)","v":0},{"$f":"IF($E6=\"SI\",VLOOKUP((CONCATENATE($A6,AT$1)),'Impactos Data'!$F$2:$G$521,2,FALSE),0)","v":0},null,{"$f":"SUM(AA6:AT6)","v":0},null,null,null,0,0,0,0,0,0,{"$f":"AG6*$Q6*$S6","v":0},{"$f":"AH6*$Q6*$U6","v":0},0,0,0,0,0,0,0,0,0,0,0,0,0]
["CA6",{"$f":"Agua!G3","v":"PAVIMENTOS PERMEABLES"},{"$f":"'2a. Componentes Agua'!S121","v":0},{"$f":"Agua!G6","v":"¿El proyecto cuenta con Pavimentos Permeables?"},"NO",0," % del total del suelo antropizado con pavimento permeable",{"$f":"'2a. Componentes Agua'!V126","v":0},null,null,null,null,null,null,"-","-",1,1,1,1,1,1,1,1,1,null,{"$f":"IF($E7=\"SI\",VLOOKUP((CONCATENATE($A7,AA$1)),'Impactos Data'!$F$2:$G$521,2,FALSE),0)","v":0},{"$f":"IF($E7=\"SI\",VLOOKUP((CONCATENATE($A7,AB$1)),'Impactos Data'!$F$2:$G$521,2,FALSE),0)","v":0},{"$f":"IF($E7=\"SI\",VLOOKUP((CONCATENATE($A7,AC$1)),'Impactos Data'!$F$2:$G$521,2,FALSE),0)","v":0},{"$f":"IF($E7=\"SI\",VLOOKUP((CONCATENATE($A7,AD$1)),'Impactos Data'!$F$2:$G$521,2,FALSE),0)","v":0},{"$f":"IF($E7=\"SI\",VLOOKUP((CONCATENATE($A7,AE$1)),'Impactos Data'!$F$2:$G$521,2,FALSE),0)","v":0},{"$f":"IF($E7=\"SI\",VLOOKUP((CONCATENATE($A7,AF$1)),'Impactos Data'!$F$2:$G$521,2,FALSE),0)","v":0},{"$f":"IF($E7=\"SI\",VLOOKUP((CONCATENATE($A7,AG$1)),'Impactos Data'!$F$2:$G$521,2,FALSE),0)","v":0},{"$f":"IF($E7=\"SI\",VLOOKUP((CONCATENATE($A7,AH$1)),'Impactos Data'!$F$2:$G$521,2,FALSE),0)","v":0},{"$f":"IF($E7=\"SI\",VLOOKUP((CONCATENATE($A7,AI$1)),'Impactos Data'!$F$2:$G$521,2,FALSE),0)","v":0},{"$f":"IF($E7=\"SI\",VLOOKUP((CONCATENATE($A7,AJ$1)),'Impactos Data'!$F$2:$G$521,2,FALSE),0)","v":0},{"$f":"IF($E7=\"SI\",VLOOKUP((CONCATENATE($A7,AK$1)),'Impactos Data'!$F$2:$G$521,2,FALSE),0)","v":0},{"$f":"IF($E7=\"SI\",VLOOKUP((CONCATENATE($A7,AL$1)),'Impactos Data'!$F$2:$G$521,2,FALSE),0)","v":0},{"$f":"IF($E7=\"SI\",VLOOKUP((CONCATENATE($A7,AM$1)),'Impactos Data'!$F$2:$G$521,2,FALSE),0)","v":0},{"$f":"IF($E7=\"SI\",VLOOKUP((CONCATENATE($A7,AN$1)),'Impactos Data'!$F$2:$G$521,2,FALSE),0)","v":0},{"$f":"IF($E7=\"SI\",VLOOKUP((CONCATENATE($A7,AO$1)),'Impactos Data'!$F$2:$G$521,2,FALSE),0)","v":0},{"$f":"IF($E7=\"SI\",VLOOKUP((CONCATENATE($A7,AP$1)),'Impactos Data'!$F$2:$G$521,2,FALSE),0)","v":0},{"$f":"IF($E7=\"SI\",VLOOKUP((CONCATENATE($A7,AQ$1)),'Impactos Data'!$F$2:$G$521,2,FALSE),0)","v":0},{"$f":"IF($E7=\"SI\",VLOOKUP((CONCATENATE($A7,AR$1)),'Impactos Data'!$F$2:$G$521,2,FALSE),0)","v":0},{"$f":"IF($E7=\"SI\",VLOOKUP((CONCATENATE($A7,AS$1)),'Impactos Data'!$F$2:$G$521,2,FALSE),0)","v":0},{"$f":"IF($E7=\"SI\",VLOOKUP((CONCATENATE($A7,AT$1)),'Impactos Data'!$F$2:$G$521,2,FALSE),0)","v":0},null,0,null,null,null,0,0,0,0,0,0,0,0,0,0,{"$f":"AK7*$Q7*$U7","v":0},0,0,0,0,0,0,0,0,0,0]
["CA7",{"$f":"Agua!H3","v":"POZOS DE ABSORCIÓN/INFILTRACIÓN"},{"$f":"'2a. Componentes Agua'!R137","v":0},{"$f":"Agua!H6","v":"¿El proyecto cuenta con pozos de absorción?"},"NO",0,{"$f":"Agua!H7","v":"Número de pozos"},{"$f":"'2a. Componentes Agua'!V140","v":0},null,null,null,null,null,null,{"$f":"Agua!H12","v":"¿Las dimensiones cumplen con el criterio de diseño que \n          evita la colmatación (ancho menor de 7.5m y profundidad \n           entre 1 -2 m) ?"},{"$f":"'2a. Componentes Agua'!V143","v":0},{"$f":"IF(P8=0,1,IF(P8=\"SI\",Agua!H15,Agua!H16))","v":1},1,1,1,1,1,1,1,1,null,{"$f":"IF($E8=\"SI\",VLOOKUP((CONCATENATE($A8,AA$1)),'Impactos Data'!$F$2:$G$521,2,FALSE),0)","v":0},{"$f":"IF($E8=\"SI\",VLOOKUP((CONCATENATE($A8,AB$1)),'Impactos Data'!$F$2:$G$521,2,FALSE),0)","v":0},{"$f":"IF($E8=\"SI\",VLOOKUP((CONCATENATE($A8,AC$1)),'Impactos Data'!$F$2:$G$521,2,FALSE),0)","v":0},{"$f":"IF($E8=\"SI\",VLOOKUP((CONCATENATE($A8,AD$1)),'Impactos Data'!$F$2:$G$521,2,FALSE),0)","v":0},{"$f":"IF($E8=\"SI\",VLOOKUP((CONCATENATE($A8,AE$1)),'Impactos Data'!$F$2:$G$521,2,FALSE),0)","v":0},{"$f":"IF($E8=\"SI\",VLOOKUP((CONCATENATE($A8,AF$1)),'Impactos Data'!$F$2:$G$521,2,FALSE),0)","v":0},{"$f":"IF($E8=\"SI\",VLOOKUP((CONCATENATE($A8,AG$1)),'Impactos Data'!$F$2:$G$521,2,FALSE),0)","v":0},{"$f":"IF($E8=\"SI\",VLOOKUP((CONCATENATE($A8,AH$1)),'Impactos Data'!$F$2:$G$521,2,FALSE),0)","v":0},{"$f":"IF($E8=\"SI\",VLOOKUP((CONCATENATE($A8,AI$1)),'Impactos Data'!$F$2:$G$521,2,FALSE),0)","v":0},{"$f":"IF($E8=\"SI\",VLOOKUP((CONCATENATE($A8,AJ$1)),'Impactos Data'!$F$2:$G$521,2,FALSE),0)","v":0},{"$f":"IF($E8=\"SI\",VLOOKUP((CONCATENATE($A8,AK$1)),'Impactos Data'!$F$2:$G$521,2,FALSE),0)","v":0},{"$f":"IF($E8=\"SI\",VLOOKUP((CONCATENATE($A8,AL$1)),'Impactos Data'!$F$2:$G$521,2,FALSE),0)","v":0},{"$f":"IF($E8=\"SI\",VLOOKUP((CONCATENATE($A8,AM$1)),'Impactos Data'!$F$2:$G$521,2,FALSE),0)","v":0},{"$f":"IF($E8=\"SI\",VLOOKUP((CONCATENATE($A8,AN$1)),'Impactos Data'!$F$2:$G$521,2,FALSE),0)","v":0},{"$f":"IF($E8=\"SI\",VLOOKUP((CONCATENATE($A8,AO$1)),'Impactos Data'!$F$2:$G$521,2,FALSE),0)","v":0},{"$f":"IF($E8=\"SI\",VLOOKUP((CONCATENATE($A8,AP$1)),'Impactos Data'!$F$2:$G$521,2,FALSE),0)","v":0},{"$f":"IF($E8=\"SI\",VLOOKUP((CONCATENATE($A8,AQ$1)),'Impactos Data'!$F$2:$G$521,2,FALSE),0)","v":0},{"$f":"IF($E8=\"SI\",VLOOKUP((CONCATENATE($A8,AR$1)),'Impactos Data'!$F$2:$G$521,2,FALSE),0)","v":0},{"$f":"IF($E8=\"SI\",VLOOKUP((CONCATENATE($A8,AS$1)),'Impactos Data'!$F$2:$G$521,2,FALSE),0)","v":0},{"$f":"IF($E8=\"SI\",VLOOKUP((CONCATENATE($A8,AT$1)),'Impactos Data'!$F$2:$G$521,2,FALSE),0)","v":0},null,0,null,null,null,0,0,0,0,0,0,0,0,0,0,0,0,{"$f":"AM8*$Q8*$U8","v":0},0,0,0,0,0,0,0,0]
["CA8",{"$f":"Agua!I3","v":" JARDINERAS FILTRANTES"},{"$f":"'2a. Componentes Agua'!R155","v":0},{"$f":"Agua!I6","v":"¿Incluye jardineras filtrantes,zanjas o pozos de infiltración?"},"NO",0,{"$f":"Agua!I7","v":"Superficie aproximada (m2)"},{"$f":"'2a. Componentes Agua'!V158","v":0},null,null,null,null,null,null,{"$f":"Agua!I12","v":"¿Incluye especies vegetales, arbustos y/o herbaceas que \n          resisten al encharcamiento y protége a los polinizadores? "},{"$f":"'2a. Componentes Agua'!V161","v":0},{"$f":"IF(P9=0,1,IF(P9=\"SI\",Agua!H15,Agua!H16))","v":1},1,1,1,1,1,1,1,1,null,{"$f":"IF($E9=\"SI\",VLOOKUP((CONCATENATE($A9,AA$1)),'Impactos Data'!$F$2:$G$521,2,FALSE),0)","v":0},{"$f":"IF($E9=\"SI\",VLOOKUP((CONCATENATE($A9,AB$1)),'Impactos Data'!$F$2:$G$521,2,FALSE),0)","v":0},{"$f":"IF($E9=\"SI\",VLOOKUP((CONCATENATE($A9,AC$1)),'Impactos Data'!$F$2:$G$521,2,FALSE),0)","v":0},{"$f":"IF($E9=\"SI\",VLOOKUP((CONCATENATE($A9,AD$1)),'Impactos Data'!$F$2:$G$521,2,FALSE),0)","v":0},{"$f":"IF($E9=\"SI\",VLOOKUP((CONCATENATE($A9,AE$1)),'Impactos Data'!$F$2:$G$521,2,FALSE),0)","v":0},{"$f":"IF($E9=\"SI\",VLOOKUP((CONCATENATE($A9,AF$1)),'Impactos Data'!$F$2:$G$521,2,FALSE),0)","v":0},{"$f":"IF($E9=\"SI\",VLOOKUP((CONCATENATE($A9,AG$1)),'Impactos Data'!$F$2:$G$521,2,FALSE),0)","v":0},{"$f":"IF($E9=\"SI\",VLOOKUP((CONCATENATE($A9,AH$1)),'Impactos Data'!$F$2:$G$521,2,FALSE),0)","v":0},{"$f":"IF($E9=\"SI\",VLOOKUP((CONCATENATE($A9,AI$1)),'Impactos Data'!$F$2:$G$521,2,FALSE),0)","v":0},{"$f":"IF($E9=\"SI\",VLOOKUP((CONCATENATE($A9,AJ$1)),'Impactos Data'!$F$2:$G$521,2,FALSE),0)","v":0},{"$f":"IF($E9=\"SI\",VLOOKUP((CONCATENATE($A9,AK$1)),'Impactos Data'!$F$2:$G$521,2,FALSE),0)","v":0},{"$f":"IF($E9=\"SI\",VLOOKUP((CONCATENATE($A9,AL$1)),'Impactos Data'!$F$2:$G$521,2,FALSE),0)","v":0},{"$f":"IF($E9=\"SI\",VLOOKUP((CONCATENATE($A9,AM$1)),'Impactos Data'!$F$2:$G$521,2,FALSE),0)","v":0},{"$f":"IF($E9=\"SI\",VLOOKUP((CONCATENATE($A9,AN$1)),'Impactos Data'!$F$2:$G$521,2,FALSE),0)","v":0},{"$f":"IF($E9=\"SI\",VLOOKUP((CONCATENATE($A9,AO$1)),'Impactos Data'!$F$2:$G$521,2,FALSE),0)","v":0},{"$f":"IF($E9=\"SI\",VLOOKUP((CONCATENATE($A9,AP$1)),'Impactos Data'!$F$2:$G$521,2,FALSE),0)","v":0},{"$f":"IF($E9=\"SI\",VLOOKUP((CONCATENATE($A9,AQ$1)),'Impactos Data'!$F$2:$G$521,2,FALSE),0)","v":0},{"$f":"IF($E9=\"SI\",VLOOKUP((CONCATENATE($A9,AR$1)),'Impactos Data'!$F$2:$G$521,2,FALSE),0)","v":0},{"$f":"IF($E9=\"SI\",VLOOKUP((CONCATENATE($A9,AS$1)),'Impactos Data'!$F$2:$G$521,2,FALSE),0)","v":0},{"$f":"IF($E9=\"SI\",VLOOKUP((CONCATENATE($A9,AT$1)),'Impactos Data'!$F$2:$G$521,2,FALSE),0)","v":0},null,0,null,null,null,0,0,0,0,0,0,0,0,0,0,0,0,{"$f":"AM9*$Q9*$U9","v":0},0,0,0,0,0,0,0,0]
[]
[]
[]
[]
[]
[]
[]
[]
[]
[null,null,null,null,null,null,null,null,null,null,null,null,null,null,null,null,null,null,null,null,null,null,null,null,null,null,{"$f":"AA1","v":1},{"$f":"AB1","v":2},3,4,5,6,7,8,9,10,11,12,13,14,15,16,17,18,19,20,null,null,null,null,null,{"$f":"AZ1","v":1},{"$f":"BA1","v":2},3,4,5,6,7,8,9,10,11,12,13,14,15,16,17,18,19,20]
[null,"SUM SI",{"$f":"SUMPRODUCT(C2:C10,F2:F10)","v":0},"COUNT SI",{"$f":"COUNTIF(E2:E10,\"SI\")","v":0},null,null,null,null,null,null,"SUMA",null,null,null,null,null,null,null,null,null,null,null,null,null,null,{"$f":"SUM(AA2:AA10)","v":0},{"$f":"SUM(AB2:AB10)","v":0},0,0,0,0,0,0,0,0,0,0,0,0,0,0,0,0,0,0,null,null,null,null,null,{"$f":"SUM(AZ2:AZ10)","v":0},{"$f":"SUM(BA2:BA10)","v":0},0,0,0,0,0,0,0,0,0,0,0,0,0,0,0,0,0,0]

{"sheet":"Impactos Data","index":12,"n_rows":521,"n_cols":12,"rows_kept":521,"cut":false,"hidden":true,"merged":[]}
["ID","Componente","Eje","ID","Impacto","SOP","Valor (qué tan directo es el impacto)","Efecto valor","Razón ","Pregunta Contextualización ","Efecto valor2","Pregunta contextualización"]
["CA1","BIODIGESTORES","AGUA",1,{"$f":"VLOOKUP(D2,Impactos!$A$2:$C$21,3)","v":"Prevención de inundaciones, regulación de escorrentías"},{"$f":"CONCATENATE(A2,D2)","v":"CA11"},0]
["CA2","CISTERNAS/PRESAS FILTRANTES","AGUA",1,{"$f":"VLOOKUP(D3,Impactos!$A$2:$C$21,3)","v":"Prevención de inundaciones, regulación de escorrentías"},{"$f":"CONCATENATE(A3,D3)","v":"CA21"},3]
["CA3","CUNETAS VERDES","AGUA",1,{"$f":"VLOOKUP(D4,Impactos!$A$2:$C$21,3)","v":"Prevención de inundaciones, regulación de escorrentías"},"CA31",3]
["CA4","DRENAJE SEPARATIVO","AGUA",1,{"$f":"VLOOKUP(D5,Impactos!$A$2:$C$21,3)","v":"Prevención de inundaciones, regulación de escorrentías"},"CA41",2]
["CA5","HUMEDAL SEMIARTIFICIAL","AGUA",1,{"$f":"VLOOKUP(D6,Impactos!$A$2:$C$21,3)","v":"Prevención de inundaciones, regulación de escorrentías"},"CA51",2]
["CA6","PAVIMENTOS PERMEABLES","AGUA",1,{"$f":"VLOOKUP(D7,Impactos!$A$2:$C$21,3)","v":"Prevención de inundaciones, regulación de escorrentías"},"CA61",3]
["CA7","POZOS DE ABSORCIÓN","AGUA",1,{"$f":"VLOOKUP(D8,Impactos!$A$2:$C$21,3)","v":"Prevención de inundaciones, regulación de escorrentías"},"CA71",2]
["CA1","BIODIGESTORES","AGUA",2,{"$f":"VLOOKUP(D9,Impactos!$A$2:$C$21,3)","v":"Reducción de los riesgos derivados de las inundaciones, regulación de avenidas."},"CA12",0]
["CA2","CISTERNAS/PRESAS FILTRANTES","AGUA",2,{"$f":"VLOOKUP(D10,Impactos!$A$2:$C$21,3)","v":"Reducción de los riesgos derivados de las inundaciones, regulación de avenidas."},"CA22",2]
["CA3","CUNETAS VERDES","AGUA",2,{"$f":"VLOOKUP(D11,Impactos!$A$2:$C$21,3)","v":"Reducción de los riesgos derivados de las inundaciones, regulación de avenidas."},"CA32",2]
["CA4","DRENAJE SEPARATIVO","AGUA",2,{"$f":"VLOOKUP(D12,Impactos!$A$2:$C$21,3)","v":"Reducción de los riesgos derivados de las inundaciones, regulación de avenidas."},"CA42",2]
["CA5","HUMEDAL SEMIARTIFICIAL","AGUA",2,{"$f":"VLOOKUP(D13,Impactos!$A$2:$C$21,3)","v":"Reducción de los riesgos derivados de las inundaciones, regulación de avenidas."},"CA52",2]
["CA6","PAVIMENTOS PERMEABLES","AGUA",2,{"$f":"VLOOKUP(D14,Impactos!$A$2:$C$21,3)","v":"Reducción de los riesgos derivados de las inundaciones, regulación de avenidas."},"CA62",1]
["CA7","POZOS DE ABSORCIÓN","AGUA",2,{"$f":"VLOOKUP(D15,Impactos!$A$2:$C$21,3)","v":"Reducción de los riesgos derivados de las inundaciones, regulación de avenidas."},"CA72",2]
["CA1","BIODIGESTORES","AGUA",3,{"$f":"VLOOKUP(D16,Impactos!$A$2:$C$21,3)","v":"Incremento de la recarga de agua de los acuíferos"},"CA13",0]
["CA2","CISTERNAS/PRESAS FILTRANTES","AGUA",3,{"$f":"VLOOKUP(D17,Impactos!$A$2:$C$21,3)","v":"Incremento de la recarga de agua de los acuíferos"},"CA23",3]
["CA3","CUNETAS VERDES","AGUA",3,{"$f":"VLOOKUP(D18,Impactos!$A$2:$C$21,3)","v":"Incremento de la recarga de agua de los acuíferos"},"CA33",3]
["CA4","DRENAJE SEPARATIVO","AGUA",3,{"$f":"VLOOKUP(D19,Impactos!$A$2:$C$21,3)","v":"Incremento de la recarga de agua de los acuíferos"},"CA43",1]
["CA5","HUMEDAL SEMIARTIFICIAL","AGUA",3,{"$f":"VLOOKUP(D20,Impactos!$A$2:$C$21,3)","v":"Incremento de la recarga de agua de los acuíferos"},"CA53",2]
["CA6","PAVIMENTOS PERMEABLES","AGUA",3,{"$f":"VLOOKUP(D21,Impactos!$A$2:$C$21,3)","v":"Incremento de la recarga de agua de los acuíferos"},"CA63",2]
["CA7","POZOS DE ABSORCIÓN","AGUA",3,{"$f":"VLOOKUP(D22,Impactos!$A$2:$C$21,3)","v":"Incremento de la recarga de agua de los acuíferos"},"CA73",3]
["CA1","BIODIGESTORES","AGUA",4,{"$f":"VLOOKUP(D23,Impactos!$A$2:$C$21,3)","v":"Regulación térmica y disminución de las islas urbanas de calor"},"CA14",0]
["CA2","CISTERNAS/PRESAS FILTRANTES","AGUA",4,{"$f":"VLOOKUP(D24,Impactos!$A$2:$C$21,3)","v":"Regulación térmica y disminución de las islas urbanas de calor"},"CA24",1]
["CA3","CUNETAS VERDES","AGUA",4,{"$f":"VLOOKUP(D25,Impactos!$A$2:$C$21,3)","v":"Regulación térmica y disminución de las islas urbanas de calor"},"CA34",2]
["CA4","DRENAJE SEPARATIVO","AGUA",4,{"$f":"VLOOKUP(D26,Impactos!$A$2:$C$21,3)","v":"Regulación térmica y disminución de las islas urbanas de calor"},"CA44",0]
["CA5","HUMEDAL SEMIARTIFICIAL","AGUA",4,{"$f":"VLOOKUP(D27,Impactos!$A$2:$C$21,3)","v":"Regulación térmica y disminución de las islas urbanas de calor"},"CA54",2]
["CA6","PAVIMENTOS PERMEABLES","AGUA",4,{"$f":"VLOOKUP(D28,Impactos!$A$2:$C$21,3)","v":"Regulación térmica y disminución de las islas urbanas de calor"},"CA64",1]
["CA7","POZOS DE ABSORCIÓN","AGUA",4,{"$f":"VLOOKUP(D29,Impactos!$A$2:$C$21,3)","v":"Regulación térmica y disminución de las islas urbanas de calor"},"CA74",0]
["CA1","BIODIGESTORES","AGUA",5,{"$f":"VLOOKUP(D30,Impactos!$A$2:$C$21,3)","v":"Mejora de la conectividad ecológica."},"CA15",0]
["CA2","CISTERNAS/PRESAS FILTRANTES","AGUA",5,{"$f":"VLOOKUP(D31,Impactos!$A$2:$C$21,3)","v":"Mejora de la conectividad ecológica."},"CA25",0]
["CA3","CUNETAS VERDES","AGUA",5,{"$f":"VLOOKUP(D32,Impactos!$A$2:$C$21,3)","v":"Mejora de la conectividad ecológica."},"CA35",2]
["CA4","DRENAJE SEPARATIVO","AGUA",5,{"$f":"VLOOKUP(D33,Impactos!$A$2:$C$21,3)","v":"Mejora de la conectividad ecológica."},"CA45",0]
["CA5","HUMEDAL SEMIARTIFICIAL","AGUA",5,{"$f":"VLOOKUP(D34,Impactos!$A$2:$C$21,3)","v":"Mejora de la conectividad ecológica."},"CA55",3]
["CA6","PAVIMENTOS PERMEABLES","AGUA",5,{"$f":"VLOOKUP(D35,Impactos!$A$2:$C$21,3)","v":"Mejora de la conectividad ecológica."},"CA65",0]
["CA7","POZOS DE ABSORCIÓN","AGUA",5,{"$f":"VLOOKUP(D36,Impactos!$A$2:$C$21,3)","v":"Mejora de la conectividad ecológica."},"CA75",0]
["CA1","BIODIGESTORES","AGUA",6,{"$f":"VLOOKUP(D37,Impactos!$A$2:$C$21,3)","v":"Secuestro de carbono "},"CA16",0]
["CA2","CISTERNAS/PRESAS FILTRANTES","AGUA",6,{"$f":"VLOOKUP(D38,Impactos!$A$2:$C$21,3)","v":"Secuestro de carbono "},"CA26",0]
["CA3","CUNETAS VERDES","AGUA",6,{"$f":"VLOOKUP(D39,Impactos!$A$2:$C$21,3)","v":"Secuestro de carbono "},"CA36",1]
["CA4","DRENAJE SEPARATIVO","AGUA",6,{"$f":"VLOOKUP(D40,Impactos!$A$2:$C$21,3)","v":"Secuestro de carbono "},"CA46",0]
["CA5","HUMEDAL SEMIARTIFICIAL","AGUA",6,{"$f":"VLOOKUP(D41,Impactos!$A$2:$C$21,3)","v":"Secuestro de carbono "},"CA56",2]
["CA6","PAVIMENTOS PERMEABLES","AGUA",6,{"$f":"VLOOKUP(D42,Impactos!$A$2:$C$21,3)","v":"Secuestro de carbono "},"CA66",0]
["CA7","POZOS DE ABSORCIÓN","AGUA",6,{"$f":"VLOOKUP(D43,Impactos!$A$2:$C$21,3)","v":"Secuestro de carbono "},"CA76",0]
["CA1","BIODIGESTORES","AGUA",7,{"$f":"VLOOKUP(D44,Impactos!$A$2:$C$21,3)","v":"Reducción de emisiones de GEI"},"CA17",3]
["CA2","CISTERNAS/PRESAS FILTRANTES","AGUA",7,{"$f":"VLOOKUP(D45,Impactos!$A$2:$C$21,3)","v":"Reducción de emisiones de GEI"},"CA27",0]
["CA3","CUNETAS VERDES","AGUA",7,{"$f":"VLOOKUP(D46,Impactos!$A$2:$C$21,3)","v":"Reducción de emisiones de GEI"},"CA37",0]
["CA4","DRENAJE SEPARATIVO","AGUA",7,{"$f":"VLOOKUP(D47,Impactos!$A$2:$C$21,3)","v":"Reducción de emisiones de GEI"},"CA47",0]
["CA5","HUMEDAL SEMIARTIFICIAL","AGUA",7,{"$f":"VLOOKUP(D48,Impactos!$A$2:$C$21,3)","v":"Reducción de emisiones de GEI"},"CA57",0]
["CA6","PAVIMENTOS PERMEABLES","AGUA",7,{"$f":"VLOOKUP(D49,Impactos!$A$2:$C$21,3)","v":"Reducción de emisiones de GEI"},"CA67",0]
["CA7","POZOS DE ABSORCIÓN","AGUA",7,{"$f":"VLOOKUP(D50,Impactos!$A$2:$C$21,3)","v":"Reducción de emisiones de GEI"},"CA77",0]
["CA1","BIODIGESTORES","AGUA",8,{"$f":"VLOOKUP(D51,Impactos!$A$2:$C$21,3)","v":"Mejora de la calidad del aire"},"CA18",0]
["CA2","CISTERNAS/PRESAS FILTRANTES","AGUA",8,{"$f":"VLOOKUP(D52,Impactos!$A$2:$C$21,3)","v":"Mejora de la calidad del aire"},"CA28",0]
["CA3","CUNETAS VERDES","AGUA",8,{"$f":"VLOOKUP(D53,Impactos!$A$2:$C$21,3)","v":"Mejora de la calidad del aire"},"CA38",0]
["CA4","DRENAJE SEPARATIVO","AGUA",8,{"$f":"VLOOKUP(D54,Impactos!$A$2:$C$21,3)","v":"Mejora de la calidad del aire"},"CA48",0]
["CA5","HUMEDAL SEMIARTIFICIAL","AGUA",8,{"$f":"VLOOKUP(D55,Impactos!$A$2:$C$21,3)","v":"Mejora de la calidad del aire"},"CA58",2]
["CA6","PAVIMENTOS PERMEABLES","AGUA",8,{"$f":"VLOOKUP(D56,Impactos!$A$2:$C$21,3)","v":"Mejora de la calidad del aire"},"CA68",0]
["CA7","POZOS DE ABSORCIÓN","AGUA",8,{"$f":"VLOOKUP(D57,Impactos!$A$2:$C$21,3)","v":"Mejora de la calidad del aire"},"CA78",0]
["CA1","BIODIGESTORES","AGUA",9,{"$f":"VLOOKUP(D58,Impactos!$A$2:$C$21,3)","v":"Mejora de la calidad del agua (purificación del agua)"},"CA19",0]
["CA2","CISTERNAS/PRESAS FILTRANTES","AGUA",9,{"$f":"VLOOKUP(D59,Impactos!$A$2:$C$21,3)","v":"Mejora de la calidad del agua (purificación del agua)"},"CA29",2]
["CA3","CUNETAS VERDES","AGUA",9,{"$f":"VLOOKUP(D60,Impactos!$A$2:$C$21,3)","v":"Mejora de la calidad del agua (purificación del agua)"},"CA39",2]
["CA4","DRENAJE SEPARATIVO","AGUA",9,{"$f":"VLOOKUP(D61,Impactos!$A$2:$C$21,3)","v":"Mejora de la calidad del agua (purificación del agua)"},"CA49",3]
["CA5","HUMEDAL SEMIARTIFICIAL","AGUA",9,{"$f":"VLOOKUP(D62,Impactos!$A$2:$C$21,3)","v":"Mejora de la calidad del agua (purificación del agua)"},"CA59",2]
["CA6","PAVIMENTOS PERMEABLES","AGUA",9,{"$f":"VLOOKUP(D63,Impactos!$A$2:$C$21,3)","v":"Mejora de la calidad del agua (purificación del agua)"},"CA69",2]
["CA7","POZOS DE ABSORCIÓN","AGUA",9,{"$f":"VLOOKUP(D64,Impactos!$A$2:$C$21,3)","v":"Mejora de la calidad del agua (purificación del agua)"},"CA79",3]
["CA1","BIODIGESTORES","AGUA",10,{"$f":"VLOOKUP(D65,Impactos!$A$2:$C$21,3)","v":"Reducción de la contaminación por ruido"},"CA110",0]
["CA2","CISTERNAS/PRESAS FILTRANTES","AGUA",10,{"$f":"VLOOKUP(D66,Impactos!$A$2:$C$21,3)","v":"Reducción de la contaminación por ruido"},"CA210",0]
["CA3","CUNETAS VERDES","AGUA",10,{"$f":"VLOOKUP(D67,Impactos!$A$2:$C$21,3)","v":"Reducción de la contaminación por ruido"},{"$f":"CONCATENATE(A67,D67)","v":"CA310"},0]
["CA4","DRENAJE SEPARATIVO","AGUA",10,{"$f":"VLOOKUP(D68,Impactos!$A$2:$C$21,3)","v":"Reducción de la contaminación por ruido"},"CA410",0]
["CA5","HUMEDAL SEMIARTIFICIAL","AGUA",10,{"$f":"VLOOKUP(D69,Impactos!$A$2:$C$21,3)","v":"Reducción de la contaminación por ruido"},"CA510",1]
["CA6","PAVIMENTOS PERMEABLES","AGUA",10,{"$f":"VLOOKUP(D70,Impactos!$A$2:$C$21,3)","v":"Reducción de la contaminación por ruido"},"CA610",1]
["CA7","POZOS DE ABSORCIÓN","AGUA",10,{"$f":"VLOOKUP(D71,Impactos!$A$2:$C$21,3)","v":"Reducción de la contaminación por ruido"},"CA710",0]
["CA1","BIODIGESTORES","AGUA",11,{"$f":"VLOOKUP(D72,Impactos!$A$2:$C$21,3)","v":"Control de la erosión del suelo"},"CA111",0]
["CA2","CISTERNAS/PRESAS FILTRANTES","AGUA",11,{"$f":"VLOOKUP(D73,Impactos!$A$2:$C$21,3)","v":"Control de la erosión del suelo"},"CA211",1]
["CA3","CUNETAS VERDES","AGUA",11,{"$f":"VLOOKUP(D74,Impactos!$A$2:$C$21,3)","v":"Control de la erosión del suelo"},"CA311",2]
["CA4","DRENAJE SEPARATIVO","AGUA",11,{"$f":"VLOOKUP(D75,Impactos!$A$2:$C$21,3)","v":"Control de la erosión del suelo"},"CA411",1]
["CA5","HUMEDAL SEMIARTIFICIAL","AGUA",11,{"$f":"VLOOKUP(D76,Impactos!$A$2:$C$21,3)","v":"Control de la erosión del suelo"},"CA511",1]
["CA6","PAVIMENTOS PERMEABLES","AGUA",11,{"$f":"VLOOKUP(D77,Impactos!$A$2:$C$21,3)","v":"Control de la erosión del suelo"},"CA611",1]
["CA7","POZOS DE ABSORCIÓN","AGUA",11,{"$f":"VLOOKUP(D78,Impactos!$A$2:$C$21,3)","v":"Control de la erosión del suelo"},"CA711",0]
["CA1","BIODIGESTORES","AGUA",12,{"$f":"VLOOKUP(D79,Impactos!$A$2:$C$21,3)","v":"Mantenimiento, protección y mejora de hábitats, vida silvestre y biodiversidad"},"CA112",0]
["CA2","CISTERNAS/PRESAS FILTRANTES","AGUA",12,{"$f":"VLOOKUP(D80,Impactos!$A$2:$C$21,3)","v":"Mantenimiento, protección y mejora de hábitats, vida silvestre y biodiversidad"},"CA212",0]
["CA3","CUNETAS VERDES","AGUA",12,{"$f":"VLOOKUP(D81,Impactos!$A$2:$C$21,3)","v":"Mantenimiento, protección y mejora de hábitats, vida silvestre y biodiversidad"},"CA312",2]
["CA4","DRENAJE SEPARATIVO","AGUA",12,{"$f":"VLOOKUP(D82,Impactos!$A$2:$C$21,3)","v":"Mantenimiento, protección y mejora de hábitats, vida silvestre y biodiversidad"},"CA412",0]
["CA5","HUMEDAL SEMIARTIFICIAL","AGUA",12,{"$f":"VLOOKUP(D83,Impactos!$A$2:$C$21,3)","v":"Mantenimiento, protección y mejora de hábitats, vida silvestre y biodiversidad"},"CA512",3]
["CA6","PAVIMENTOS PERMEABLES","AGUA",12,{"$f":"VLOOKUP(D84,Impactos!$A$2:$C$21,3)","v":"Mantenimiento, protección y mejora de hábitats, vida silvestre y biodiversidad"},"CA612",0]
["CA7","POZOS DE ABSORCIÓN","AGUA",12,{"$f":"VLOOKUP(D85,Impactos!$A$2:$C$21,3)","v":"Mantenimiento, protección y mejora de hábitats, vida silvestre y biodiversidad"},"CA712",1]
["CA1","BIODIGESTORES","AGUA",13,{"$f":"VLOOKUP(D86,Impactos!$A$2:$C$21,3)","v":"Producción de servicios ecosistémicos"},"CA113",0]
["CA2","CISTERNAS/PRESAS FILTRANTES","AGUA",13,{"$f":"VLOOKUP(D87,Impactos!$A$2:$C$21,3)","v":"Producción de servicios ecosistémicos"},"CA213",0]
["CA3","CUNETAS VERDES","AGUA",13,{"$f":"VLOOKUP(D88,Impactos!$A$2:$C$21,3)","v":"Producción de servicios ecosistémicos"},"CA313",2]
["CA4","DRENAJE SEPARATIVO","AGUA",13,{"$f":"VLOOKUP(D89,Impactos!$A$2:$C$21,3)","v":"Producción de servicios ecosistémicos"},"CA413",0]
["CA5","HUMEDAL SEMIARTIFICIAL","AGUA",13,{"$f":"VLOOKUP(D90,Impactos!$A$2:$C$21,3)","v":"Producción de servicios ecosistémicos"},"CA513",3]
["CA6","PAVIMENTOS PERMEABLES","AGUA",13,{"$f":"VLOOKUP(D91,Impactos!$A$2:$C$21,3)","v":"Producción de servicios ecosistémicos"},"CA613",0]
["CA7","POZOS DE ABSORCIÓN","AGUA",13,{"$f":"VLOOKUP(D92,Impactos!$A$2:$C$21,3)","v":"Producción de servicios ecosistémicos"},"CA713",0]
["CA1","BIODIGESTORES","AGUA",14,{"$f":"VLOOKUP(D93,Impactos!$A$2:$C$21,3)","v":"Mejora de los valores estéticos"},"CA114",0]
["CA2","CISTERNAS/PRESAS FILTRANTES","AGUA",14,{"$f":"VLOOKUP(D94,Impactos!$A$2:$C$21,3)","v":"Mejora de los valores estéticos"},"CA214",1]
["CA3","CUNETAS VERDES","AGUA",14,{"$f":"VLOOKUP(D95,Impactos!$A$2:$C$21,3)","v":"Mejora de los valores estéticos"},"CA314",3]
["CA4","DRENAJE SEPARATIVO","AGUA",14,{"$f":"VLOOKUP(D96,Impactos!$A$2:$C$21,3)","v":"Mejora de los valores estéticos"},"CA414",0]
["CA5","HUMEDAL SEMIARTIFICIAL","AGUA",14,{"$f":"VLOOKUP(D97,Impactos!$A$2:$C$21,3)","v":"Mejora de los valores estéticos"},"CA514",2]
["CA6","PAVIMENTOS PERMEABLES","AGUA",14,{"$f":"VLOOKUP(D98,Impactos!$A$2:$C$21,3)","v":"Mejora de los valores estéticos"},"CA614",1]
["CA7","POZOS DE ABSORCIÓN","AGUA",14,{"$f":"VLOOKUP(D99,Impactos!$A$2:$C$21,3)","v":"Mejora de los valores estéticos"},"CA714",1]
["CA1","BIODIGESTORES","AGUA",15,{"$f":"VLOOKUP(D100,Impactos!$A$2:$C$21,3)","v":"Mejora accesibilidad de recursos para deporte, cultura, formación y recreación"},"CA115",0]
["CA2","CISTERNAS/PRESAS FILTRANTES","AGUA",15,{"$f":"VLOOKUP(D101,Impactos!$A$2:$C$21,3)","v":"Mejora accesibilidad de recursos para deporte, cultura, formación y recreación"},"CA215",0]
["CA3","CUNETAS VERDES","AGUA",15,{"$f":"VLOOKUP(D102,Impactos!$A$2:$C$21,3)","v":"Mejora accesibilidad de recursos para deporte, cultura, formación y recreación"},"CA315",0]
["CA4","DRENAJE SEPARATIVO","AGUA",15,{"$f":"VLOOKUP(D103,Impactos!$A$2:$C$21,3)","v":"Mejora accesibilidad de recursos para deporte, cultura, formación y recreación"},"CA415",0]
["CA5","HUMEDAL SEMIARTIFICIAL","AGUA",15,{"$f":"VLOOKUP(D104,Impactos!$A$2:$C$21,3)","v":"Mejora accesibilidad de recursos para deporte, cultura, formación y recreación"},"CA515",2]
["CA6","PAVIMENTOS PERMEABLES","AGUA",15,{"$f":"VLOOKUP(D105,Impactos!$A$2:$C$21,3)","v":"Mejora accesibilidad de recursos para deporte, cultura, formación y recreación"},"CA615",1]
["CA7","POZOS DE ABSORCIÓN","AGUA",15,{"$f":"VLOOKUP(D106,Impactos!$A$2:$C$21,3)","v":"Mejora accesibilidad de recursos para deporte, cultura, formación y recreación"},"CA715",0]
["CA1","BIODIGESTORES","AGUA",16,{"$f":"VLOOKUP(D107,Impactos!$A$2:$C$21,3)","v":"Mejora de la salud y bienestar"},"CA116",0]
["CA2","CISTERNAS/PRESAS FILTRANTES","AGUA",16,{"$f":"VLOOKUP(D108,Impactos!$A$2:$C$21,3)","v":"Mejora de la salud y bienestar"},"CA216",0]
["CA3","CUNETAS VERDES","AGUA",16,{"$f":"VLOOKUP(D109,Impactos!$A$2:$C$21,3)","v":"Mejora de la salud y bienestar"},"CA316",0]
["CA4","DRENAJE SEPARATIVO","AGUA",16,{"$f":"VLOOKUP(D110,Impactos!$A$2:$C$21,3)","v":"Mejora de la salud y bienestar"},"CA416",0]
["CA5","HUMEDAL SEMIARTIFICIAL","AGUA",16,{"$f":"VLOOKUP(D111,Impactos!$A$2:$C$21,3)","v":"Mejora de la salud y bienestar"},"CA516",2]
["CA6","PAVIMENTOS PERMEABLES","AGUA",16,{"$f":"VLOOKUP(D112,Impactos!$A$2:$C$21,3)","v":"Mejora de la salud y bienestar"},"CA616",0]
["CA7","POZOS DE ABSORCIÓN","AGUA",16,{"$f":"VLOOKUP(D113,Impactos!$A$2:$C$21,3)","v":"Mejora de la salud y bienestar"},"CA716",0]
["CA1","BIODIGESTORES","AGUA",17,{"$f":"VLOOKUP(D114,Impactos!$A$2:$C$21,3)","v":"Generación de recursos comunitarios (fortalecimiento de la ciudadanía)"},"CA117",0]
["CA2","CISTERNAS/PRESAS FILTRANTES","AGUA",17,{"$f":"VLOOKUP(D115,Impactos!$A$2:$C$21,3)","v":"Generación de recursos comunitarios (fortalecimiento de la ciudadanía)"},"CA217",0]
["CA3","CUNETAS VERDES","AGUA",17,{"$f":"VLOOKUP(D116,Impactos!$A$2:$C$21,3)","v":"Generación de recursos comunitarios (fortalecimiento de la ciudadanía)"},"CA317",0]
["CA4","DRENAJE SEPARATIVO","AGUA",17,{"$f":"VLOOKUP(D117,Impactos!$A$2:$C$21,3)","v":"Generación de recursos comunitarios (fortalecimiento de la ciudadanía)"},"CA417",0]
["CA5","HUMEDAL SEMIARTIFICIAL","AGUA",17,{"$f":"VLOOKUP(D118,Impactos!$A$2:$C$21,3)","v":"Generación de recursos comunitarios (fortalecimiento de la ciudadanía)"},"CA517",0]
["CA6","PAVIMENTOS PERMEABLES","AGUA",17,{"$f":"VLOOKUP(D119,Impactos!$A$2:$C$21,3)","v":"Generación de recursos comunitarios (fortalecimiento de la ciudadanía)"},"CA617",0]
["CA7","POZOS DE ABSORCIÓN","AGUA",17,{"$f":"VLOOKUP(D120,Impactos!$A$2:$C$21,3)","v":"Generación de recursos comunitarios (fortalecimiento de la ciudadanía)"},"CA717",0]
["CA1","BIODIGESTORES","AGUA",18,{"$f":"VLOOKUP(D121,Impactos!$A$2:$C$21,3)","v":"Fortalecimiento de sentimiento de pertenencia e identidad"},"CA118",0]
["CA2","CISTERNAS/PRESAS FILTRANTES","AGUA",18,{"$f":"VLOOKUP(D122,Impactos!$A$2:$C$21,3)","v":"Fortalecimiento de sentimiento de pertenencia e identidad"},"CA218",0]
["CA3","CUNETAS VERDES","AGUA",18,{"$f":"VLOOKUP(D123,Impactos!$A$2:$C$21,3)","v":"Fortalecimiento de sentimiento de pertenencia e identidad"},"CA318",0]
["CA4","DRENAJE SEPARATIVO","AGUA",18,{"$f":"VLOOKUP(D124,Impactos!$A$2:$C$21,3)","v":"Fortalecimiento de sentimiento de pertenencia e identidad"},"CA418",0]
["CA5","HUMEDAL SEMIARTIFICIAL","AGUA",18,{"$f":"VLOOKUP(D125,Impactos!$A$2:$C$21,3)","v":"Fortalecimiento de sentimiento de pertenencia e identidad"},"CA518",2]
["CA6","PAVIMENTOS PERMEABLES","AGUA",18,{"$f":"VLOOKUP(D126,Impactos!$A$2:$C$21,3)","v":"Fortalecimiento de sentimiento de pertenencia e identidad"},"CA618",1]
["CA7","POZOS DE ABSORCIÓN","AGUA",18,{"$f":"VLOOKUP(D127,Impactos!$A$2:$C$21,3)","v":"Fortalecimiento de sentimiento de pertenencia e identidad"},"CA718",0]
["CA1","BIODIGESTORES","AGUA",19,{"$f":"VLOOKUP(D128,Impactos!$A$2:$C$21,3)","v":"Optimización de la inversión pública "},"CA119",2]
["CA2","CISTERNAS/PRESAS FILTRANTES","AGUA",19,{"$f":"VLOOKUP(D129,Impactos!$A$2:$C$21,3)","v":"Optimización de la inversión pública "},"CA219",0]
["CA3","CUNETAS VERDES","AGUA",19,{"$f":"VLOOKUP(D130,Impactos!$A$2:$C$21,3)","v":"Optimización de la inversión pública "},"CA319",0]
["CA4","DRENAJE SEPARATIVO","AGUA",19,{"$f":"VLOOKUP(D131,Impactos!$A$2:$C$21,3)","v":"Optimización de la inversión pública "},{"$f":"CONCATENATE(A131,D131)","v":"CA419"},0]
["CA5","HUMEDAL SEMIARTIFICIAL","AGUA",19,{"$f":"VLOOKUP(D132,Impactos!$A$2:$C$21,3)","v":"Optimización de la inversión pública "},"CA519",2]
["CA6","PAVIMENTOS PERMEABLES","AGUA",19,{"$f":"VLOOKUP(D133,Impactos!$A$2:$C$21,3)","v":"Optimización de la inversión pública "},"CA619",1]
["CA7","POZOS DE ABSORCIÓN","AGUA",19,{"$f":"VLOOKUP(D134,Impactos!$A$2:$C$21,3)","v":"Optimización de la inversión pública "},"CA719",1]
["CA1","BIODIGESTORES","AGUA",20,{"$f":"VLOOKUP(D135,Impactos!$A$2:$C$21,3)","v":"Atracción para negocios, turismo y economía verde"},"CA120",0]
["CA2","CISTERNAS/PRESAS FILTRANTES","AGUA",20,{"$f":"VLOOKUP(D136,Impactos!$A$2:$C$21,3)","v":"Atracción para negocios, turismo y economía verde"},"CA220",0]
["CA3","CUNETAS VERDES","AGUA",20,{"$f":"VLOOKUP(D137,Impactos!$A$2:$C$21,3)","v":"Atracción para negocios, turismo y economía verde"},"CA320",0]
["CA4","DRENAJE SEPARATIVO","AGUA",20,{"$f":"VLOOKUP(D138,Impactos!$A$2:$C$21,3)","v":"Atracción para negocios, turismo y economía verde"},"CA420",0]
["CA5","HUMEDAL SEMIARTIFICIAL","AGUA",20,{"$f":"VLOOKUP(D139,Impactos!$A$2:$C$21,3)","v":"Atracción para negocios, turismo y economía verde"},"CA520",2]
["CA6","PAVIMENTOS PERMEABLES","AGUA",20,{"$f":"VLOOKUP(D140,Impactos!$A$2:$C$21,3)","v":"Atracción para negocios, turismo y economía verde"},"CA620",1]
["CA7","POZOS DE ABSORCIÓN","AGUA",20,{"$f":"VLOOKUP(D141,Impactos!$A$2:$C$21,3)","v":"Atracción para negocios, turismo y economía verde"},"CA720",0]
["CB1","ARBOLADO","BIODIVERSIDAD",1,{"$f":"VLOOKUP(D142,Impactos!$A$2:$C$21,3)","v":"Prevención de inundaciones, regulación de escorrentías"},{"$f":"CONCATENATE(A142,D142)","v":"CB11"},3]
["CB2","BOSQUE URBANO","BIODIVERSIDAD",1,{"$f":"VLOOKUP(D143,Impactos!$A$2:$C$21,3)","v":"Prevención de inundaciones, regulación de escorrentías"},{"$f":"CONCATENATE(A143,D143)","v":"CB21"},3]
["CB3","JARDINES EDUCATIVOS","BIODIVERSIDAD",1,{"$f":"VLOOKUP(D144,Impactos!$A$2:$C$21,3)","v":"Prevención de inundaciones, regulación de escorrentías"},"CB31",2]
["CB4","HUERTOS URBANOS","BIODIVERSIDAD",1,{"$f":"VLOOKUP(D145,Impactos!$A$2:$C$21,3)","v":"Prevención de inundaciones, regulación de escorrentías"},"CB41",2]
["CB5","RENATURALIZACION DE ELEMENTOS FLUVIALES","BIODIVERSIDAD",1,{"$f":"VLOOKUP(D146,Impactos!$A$2:$C$21,3)","v":"Prevención de inundaciones, regulación de escorrentías"},"CB51",2]
["CB6","DESENTUBADO DE RIOS","BIODIVERSIDAD",1,{"$f":"VLOOKUP(D147,Impactos!$A$2:$C$21,3)","v":"Prevención de inundaciones, regulación de escorrentías"},"CB61",3]
["CB1","ARBOLADO","BIODIVERSIDAD",2,{"$f":"VLOOKUP(D148,Impactos!$A$2:$C$21,3)","v":"Reducción de los riesgos derivados de las inundaciones, regulación de avenidas."},"CB12",3]
["CB2","BOSQUE URBANO","BIODIVERSIDAD",2,{"$f":"VLOOKUP(D149,Impactos!$A$2:$C$21,3)","v":"Reducción de los riesgos derivados de las inundaciones, regulación de avenidas."},"CB22",3]
["CB3","JARDINES EDUCATIVOS","BIODIVERSIDAD",2,{"$f":"VLOOKUP(D150,Impactos!$A$2:$C$21,3)","v":"Reducción de los riesgos derivados de las inundaciones, regulación de avenidas."},"CB32",2]
["CB4","HUERTOS URBANOS","BIODIVERSIDAD",2,{"$f":"VLOOKUP(D151,Impactos!$A$2:$C$21,3)","v":"Reducción de los riesgos derivados de las inundaciones, regulación de avenidas."},"CB42",2]
["CB5","RENATURALIZACION DE ELEMENTOS FLUVIALES","BIODIVERSIDAD",2,{"$f":"VLOOKUP(D152,Impactos!$A$2:$C$21,3)","v":"Reducción de los riesgos derivados de las inundaciones, regulación de avenidas."},"CB52",3]
["CB6","DESENTUBADO DE RIOS","BIODIVERSIDAD",2,{"$f":"VLOOKUP(D153,Impactos!$A$2:$C$21,3)","v":"Reducción de los riesgos derivados de las inundaciones, regulación de avenidas."},"CB62",3]
["CB1","ARBOLADO","BIODIVERSIDAD",3,{"$f":"VLOOKUP(D154,Impactos!$A$2:$C$21,3)","v":"Incremento de la recarga de agua de los acuíferos"},"CB13",3]
["CB2","BOSQUE URBANO","BIODIVERSIDAD",3,{"$f":"VLOOKUP(D155,Impactos!$A$2:$C$21,3)","v":"Incremento de la recarga de agua de los acuíferos"},"CB23",3]
["CB3","JARDINES EDUCATIVOS","BIODIVERSIDAD",3,{"$f":"VLOOKUP(D156,Impactos!$A$2:$C$21,3)","v":"Incremento de la recarga de agua de los acuíferos"},"CB33",2]
["CB4","HUERTOS URBANOS","BIODIVERSIDAD",3,{"$f":"VLOOKUP(D157,Impactos!$A$2:$C$21,3)","v":"Incremento de la recarga de agua de los acuíferos"},"CB43",2]
["CB5","RENATURALIZACION DE ELEMENTOS FLUVIALES","BIODIVERSIDAD",3,{"$f":"VLOOKUP(D158,Impactos!$A$2:$C$21,3)","v":"Incremento de la recarga de agua de los acuíferos"},"CB53",2]
["CB6","DESENTUBADO DE RIOS","BIODIVERSIDAD",3,{"$f":"VLOOKUP(D159,Impactos!$A$2:$C$21,3)","v":"Incremento de la recarga de agua de los acuíferos"},"CB63",2]
["CB1","ARBOLADO","BIODIVERSIDAD",4,{"$f":"VLOOKUP(D160,Impactos!$A$2:$C$21,3)","v":"Regulación térmica y disminución de las islas urbanas de calor"},"CB14",3]
["CB2","BOSQUE URBANO","BIODIVERSIDAD",4,{"$f":"VLOOKUP(D161,Impactos!$A$2:$C$21,3)","v":"Regulación térmica y disminución de las islas urbanas de calor"},"CB24",3]
["CB3","JARDINES EDUCATIVOS","BIODIVERSIDAD",4,{"$f":"VLOOKUP(D162,Impactos!$A$2:$C$21,3)","v":"Regulación térmica y disminución de las islas urbanas de calor"},"CB34",2]
["CB4","HUERTOS URBANOS","BIODIVERSIDAD",4,{"$f":"VLOOKUP(D163,Impactos!$A$2:$C$21,3)","v":"Regulación térmica y disminución de las islas urbanas de calor"},"CB44",2]
["CB5","RENATURALIZACION DE ELEMENTOS FLUVIALES","BIODIVERSIDAD",4,{"$f":"VLOOKUP(D164,Impactos!$A$2:$C$21,3)","v":"Regulación térmica y disminución de las islas urbanas de calor"},"CB54",2]
["CB6","DESENTUBADO DE RIOS","BIODIVERSIDAD",4,{"$f":"VLOOKUP(D165,Impactos!$A$2:$C$21,3)","v":"Regulación térmica y disminución de las islas urbanas de calor"},"CB64",3]
["CB1","ARBOLADO","BIODIVERSIDAD",5,{"$f":"VLOOKUP(D166,Impactos!$A$2:$C$21,3)","v":"Mejora de la conectividad ecológica."},"CB15",3]
["CB2","BOSQUE URBANO","BIODIVERSIDAD",5,{"$f":"VLOOKUP(D167,Impactos!$A$2:$C$21,3)","v":"Mejora de la conectividad ecológica."},"CB25",3]
["CB3","JARDINES EDUCATIVOS","BIODIVERSIDAD",5,{"$f":"VLOOKUP(D168,Impactos!$A$2:$C$21,3)","v":"Mejora de la conectividad ecológica."},"CB35",3]
["CB4","HUERTOS URBANOS","BIODIVERSIDAD",5,{"$f":"VLOOKUP(D169,Impactos!$A$2:$C$21,3)","v":"Mejora de la conectividad ecológica."},"CB45",3]
["CB5","RENATURALIZACION DE ELEMENTOS FLUVIALES","BIODIVERSIDAD",5,{"$f":"VLOOKUP(D170,Impactos!$A$2:$C$21,3)","v":"Mejora de la conectividad ecológica."},"CB55",3]
["CB6","DESENTUBADO DE RIOS","BIODIVERSIDAD",5,{"$f":"VLOOKUP(D171,Impactos!$A$2:$C$21,3)","v":"Mejora de la conectividad ecológica."},"CB65",3]
["CB1","ARBOLADO","BIODIVERSIDAD",6,{"$f":"VLOOKUP(D172,Impactos!$A$2:$C$21,3)","v":"Secuestro de carbono "},"CB16",3]
["CB2","BOSQUE URBANO","BIODIVERSIDAD",6,{"$f":"VLOOKUP(D173,Impactos!$A$2:$C$21,3)","v":"Secuestro de carbono "},"CB26",3]
["CB3","JARDINES EDUCATIVOS","BIODIVERSIDAD",6,{"$f":"VLOOKUP(D174,Impactos!$A$2:$C$21,3)","v":"Secuestro de carbono "},"CB36",2]
["CB4","HUERTOS URBANOS","BIODIVERSIDAD",6,{"$f":"VLOOKUP(D175,Impactos!$A$2:$C$21,3)","v":"Secuestro de carbono "},"CB46",2]
["CB5","RENATURALIZACION DE ELEMENTOS FLUVIALES","BIODIVERSIDAD",6,{"$f":"VLOOKUP(D176,Impactos!$A$2:$C$21,3)","v":"Secuestro de carbono "},"CB56",2]
["CB6","DESENTUBADO DE RIOS","BIODIVERSIDAD",6,{"$f":"VLOOKUP(D177,Impactos!$A$2:$C$21,3)","v":"Secuestro de carbono "},"CB66",1]
["CB1","ARBOLADO","BIODIVERSIDAD",7,{"$f":"VLOOKUP(D178,Impactos!$A$2:$C$21,3)","v":"Reducción de emisiones de GEI"},"CB17",0]
["CB2","BOSQUE URBANO","BIODIVERSIDAD",7,{"$f":"VLOOKUP(D179,Impactos!$A$2:$C$21,3)","v":"Reducción de emisiones de GEI"},"CB27",0]
["CB3","JARDINES EDUCATIVOS","BIODIVERSIDAD",7,{"$f":"VLOOKUP(D180,Impactos!$A$2:$C$21,3)","v":"Reducción de emisiones de GEI"},"CB37",0]
["CB4","HUERTOS URBANOS","BIODIVERSIDAD",7,{"$f":"VLOOKUP(D181,Impactos!$A$2:$C$21,3)","v":"Reducción de emisiones de GEI"},"CB47",0]
["CB5","RENATURALIZACION DE ELEMENTOS FLUVIALES","BIODIVERSIDAD",7,{"$f":"VLOOKUP(D182,Impactos!$A$2:$C$21,3)","v":"Reducción de emisiones de GEI"},"CB57",1]
["CB6","DESENTUBADO DE RIOS","BIODIVERSIDAD",7,{"$f":"VLOOKUP(D183,Impactos!$A$2:$C$21,3)","v":"Reducción de emisiones de GEI"},"CB67",0]
["CB1","ARBOLADO","BIODIVERSIDAD",8,{"$f":"VLOOKUP(D184,Impactos!$A$2:$C$21,3)","v":"Mejora de la calidad del aire"},"CB18",3]
["CB2","BOSQUE URBANO","BIODIVERSIDAD",8,{"$f":"VLOOKUP(D185,Impactos!$A$2:$C$21,3)","v":"Mejora de la calidad del aire"},"CB28",3]
["CB3","JARDINES EDUCATIVOS","BIODIVERSIDAD",8,{"$f":"VLOOKUP(D186,Impactos!$A$2:$C$21,3)","v":"Mejora de la calidad del aire"},"CB38",2]
["CB4","HUERTOS URBANOS","BIODIVERSIDAD",8,{"$f":"VLOOKUP(D187,Impactos!$A$2:$C$21,3)","v":"Mejora de la calidad del aire"},"CB48",1]
["CB5","RENATURALIZACION DE ELEMENTOS FLUVIALES","BIODIVERSIDAD",8,{"$f":"VLOOKUP(D188,Impactos!$A$2:$C$21,3)","v":"Mejora de la calidad del aire"},"CB58",2]
["CB6","DESENTUBADO DE RIOS","BIODIVERSIDAD",8,{"$f":"VLOOKUP(D189,Impactos!$A$2:$C$21,3)","v":"Mejora de la calidad del aire"},"CB68",2]
["CB1","ARBOLADO","BIODIVERSIDAD",9,{"$f":"VLOOKUP(D190,Impactos!$A$2:$C$21,3)","v":"Mejora de la calidad del agua (purificación del agua)"},"CB19",2]
["CB2","BOSQUE URBANO","BIODIVERSIDAD",9,{"$f":"VLOOKUP(D191,Impactos!$A$2:$C$21,3)","v":"Mejora de la calidad del agua (purificación del agua)"},"CB29",3]
["CB3","JARDINES EDUCATIVOS","BIODIVERSIDAD",9,{"$f":"VLOOKUP(D192,Impactos!$A$2:$C$21,3)","v":"Mejora de la calidad del agua (purificación del agua)"},"CB39",2]
["CB4","HUERTOS URBANOS","BIODIVERSIDAD",9,{"$f":"VLOOKUP(D193,Impactos!$A$2:$C$21,3)","v":"Mejora de la calidad del agua (purificación del agua)"},"CB49",2]
["CB5","RENATURALIZACION DE ELEMENTOS FLUVIALES","BIODIVERSIDAD",9,{"$f":"VLOOKUP(D194,Impactos!$A$2:$C$21,3)","v":"Mejora de la calidad del agua (purificación del agua)"},"CB59",2]
["CB6","DESENTUBADO DE RIOS","BIODIVERSIDAD",9,{"$f":"VLOOKUP(D195,Impactos!$A$2:$C$21,3)","v":"Mejora de la calidad del agua (purificación del agua)"},"CB69",2]
["CB1","ARBOLADO","BIODIVERSIDAD",10,{"$f":"VLOOKUP(D196,Impactos!$A$2:$C$21,3)","v":"Reducción de la contaminación por ruido"},"CB110",3]
["CB2","BOSQUE URBANO","BIODIVERSIDAD",10,{"$f":"VLOOKUP(D197,Impactos!$A$2:$C$21,3)","v":"Reducción de la contaminación por ruido"},"CB210",3]
["CB3","JARDINES EDUCATIVOS","BIODIVERSIDAD",10,{"$f":"VLOOKUP(D198,Impactos!$A$2:$C$21,3)","v":"Reducción de la contaminación por ruido"},"CB310",2]
["CB4","HUERTOS URBANOS","BIODIVERSIDAD",10,{"$f":"VLOOKUP(D199,Impactos!$A$2:$C$21,3)","v":"Reducción de la contaminación por ruido"},"CB410",2]
["CB5","RENATURALIZACION DE ELEMENTOS FLUVIALES","BIODIVERSIDAD",10,{"$f":"VLOOKUP(D200,Impactos!$A$2:$C$21,3)","v":"Reducción de la contaminación por ruido"},"CB510",2]
["CB6","DESENTUBADO DE RIOS","BIODIVERSIDAD",10,{"$f":"VLOOKUP(D201,Impactos!$A$2:$C$21,3)","v":"Reducción de la contaminación por ruido"},"CB610",3]
["CB1","ARBOLADO","BIODIVERSIDAD",11,{"$f":"VLOOKUP(D202,Impactos!$A$2:$C$21,3)","v":"Control de la erosión del suelo"},"CB111",3]
["CB2","BOSQUE URBANO","BIODIVERSIDAD",11,{"$f":"VLOOKUP(D203,Impactos!$A$2:$C$21,3)","v":"Control de la erosión del suelo"},"CB211",3]
["CB3","JARDINES EDUCATIVOS","BIODIVERSIDAD",11,{"$f":"VLOOKUP(D204,Impactos!$A$2:$C$21,3)","v":"Control de la erosión del suelo"},"CB311",2]
["CB4","HUERTOS URBANOS","BIODIVERSIDAD",11,{"$f":"VLOOKUP(D205,Impactos!$A$2:$C$21,3)","v":"Control de la erosión del suelo"},"CB411",3]
["CB5","RENATURALIZACION DE ELEMENTOS FLUVIALES","BIODIVERSIDAD",11,{"$f":"VLOOKUP(D206,Impactos!$A$2:$C$21,3)","v":"Control de la erosión del suelo"},"CB511",3]
["CB6","DESENTUBADO DE RIOS","BIODIVERSIDAD",11,{"$f":"VLOOKUP(D207,Impactos!$A$2:$C$21,3)","v":"Control de la erosión del suelo"},{"$f":"CONCATENATE(A207,D207)","v":"CB611"},2]
["CB1","ARBOLADO","BIODIVERSIDAD",12,{"$f":"VLOOKUP(D208,Impactos!$A$2:$C$21,3)","v":"Mantenimiento, protección y mejora de hábitats, vida silvestre y biodiversidad"},"CB112",3]
["CB2","BOSQUE URBANO","BIODIVERSIDAD",12,{"$f":"VLOOKUP(D209,Impactos!$A$2:$C$21,3)","v":"Mantenimiento, protección y mejora de hábitats, vida silvestre y biodiversidad"},"CB212",3]
["CB3","JARDINES EDUCATIVOS","BIODIVERSIDAD",12,{"$f":"VLOOKUP(D210,Impactos!$A$2:$C$21,3)","v":"Mantenimiento, protección y mejora de hábitats, vida silvestre y biodiversidad"},"CB312",2]
["CB4","HUERTOS URBANOS","BIODIVERSIDAD",12,{"$f":"VLOOKUP(D211,Impactos!$A$2:$C$21,3)","v":"Mantenimiento, protección y mejora de hábitats, vida silvestre y biodiversidad"},"CB412",2]
["CB5","RENATURALIZACION DE ELEMENTOS FLUVIALES","BIODIVERSIDAD",12,{"$f":"VLOOKUP(D212,Impactos!$A$2:$C$21,3)","v":"Mantenimiento, protección y mejora de hábitats, vida silvestre y biodiversidad"},"CB512",3]
["CB6","DESENTUBADO DE RIOS","BIODIVERSIDAD",12,{"$f":"VLOOKUP(D213,Impactos!$A$2:$C$21,3)","v":"Mantenimiento, protección y mejora de hábitats, vida silvestre y biodiversidad"},"CB612",3]
["CB1","ARBOLADO","BIODIVERSIDAD",13,{"$f":"VLOOKUP(D214,Impactos!$A$2:$C$21,3)","v":"Producción de servicios ecosistémicos"},"CB113",3]
["CB2","BOSQUE URBANO","BIODIVERSIDAD",13,{"$f":"VLOOKUP(D215,Impactos!$A$2:$C$21,3)","v":"Producción de servicios ecosistémicos"},"CB213",3]
["CB3","JARDINES EDUCATIVOS","BIODIVERSIDAD",13,{"$f":"VLOOKUP(D216,Impactos!$A$2:$C$21,3)","v":"Producción de servicios ecosistémicos"},"CB313",2]
["CB4","HUERTOS URBANOS","BIODIVERSIDAD",13,{"$f":"VLOOKUP(D217,Impactos!$A$2:$C$21,3)","v":"Producción de servicios ecosistémicos"},"CB413",2]
["CB5","RENATURALIZACION DE ELEMENTOS FLUVIALES","BIODIVERSIDAD",13,{"$f":"VLOOKUP(D218,Impactos!$A$2:$C$21,3)","v":"Producción de servicios ecosistémicos"},"CB513",3]
["CB6","DESENTUBADO DE RIOS","BIODIVERSIDAD",13,{"$f":"VLOOKUP(D219,Impactos!$A$2:$C$21,3)","v":"Producción de servicios ecosistémicos"},"CB613",3]
["CB1","ARBOLADO","BIODIVERSIDAD",14,{"$f":"VLOOKUP(D220,Impactos!$A$2:$C$21,3)","v":"Mejora de los valores estéticos"},"CB114",3]
["CB2","BOSQUE URBANO","BIODIVERSIDAD",14,{"$f":"VLOOKUP(D221,Impactos!$A$2:$C$21,3)","v":"Mejora de los valores estéticos"},"CB214",3]
["CB3","JARDINES EDUCATIVOS","BIODIVERSIDAD",14,{"$f":"VLOOKUP(D222,Impactos!$A$2:$C$21,3)","v":"Mejora de los valores estéticos"},"CB314",2]
["CB4","HUERTOS URBANOS","BIODIVERSIDAD",14,{"$f":"VLOOKUP(D223,Impactos!$A$2:$C$21,3)","v":"Mejora de los valores estéticos"},"CB414",2]
["CB5","RENATURALIZACION DE ELEMENTOS FLUVIALES","BIODIVERSIDAD",14,{"$f":"VLOOKUP(D224,Impactos!$A$2:$C$21,3)","v":"Mejora de los valores estéticos"},"CB514",3]
["CB6","DESENTUBADO DE RIOS","BIODIVERSIDAD",14,{"$f":"VLOOKUP(D225,Impactos!$A$2:$C$21,3)","v":"Mejora de los valores estéticos"},"CB614",3]
["CB1","ARBOLADO","BIODIVERSIDAD",15,{"$f":"VLOOKUP(D226,Impactos!$A$2:$C$21,3)","v":"Mejora accesibilidad de recursos para deporte, cultura, formación y recreación"},"CB115",1]
["CB2","BOSQUE URBANO","BIODIVERSIDAD",15,{"$f":"VLOOKUP(D227,Impactos!$A$2:$C$21,3)","v":"Mejora accesibilidad de recursos para deporte, cultura, formación y recreación"},"CB215",3]
["CB3","JARDINES EDUCATIVOS","BIODIVERSIDAD",15,{"$f":"VLOOKUP(D228,Impactos!$A$2:$C$21,3)","v":"Mejora accesibilidad de recursos para deporte, cultura, formación y recreación"},"CB315",3]
["CB4","HUERTOS URBANOS","BIODIVERSIDAD",15,{"$f":"VLOOKUP(D229,Impactos!$A$2:$C$21,3)","v":"Mejora accesibilidad de recursos para deporte, cultura, formación y recreación"},"CB415",3]
["CB5","RENATURALIZACION DE ELEMENTOS FLUVIALES","BIODIVERSIDAD",15,{"$f":"VLOOKUP(D230,Impactos!$A$2:$C$21,3)","v":"Mejora accesibilidad de recursos para deporte, cultura, formación y recreación"},"CB515",2]
["CB6","DESENTUBADO DE RIOS","BIODIVERSIDAD",15,{"$f":"VLOOKUP(D231,Impactos!$A$2:$C$21,3)","v":"Mejora accesibilidad de recursos para deporte, cultura, formación y recreación"},"CB615",2]
["CB1","ARBOLADO","BIODIVERSIDAD",16,{"$f":"VLOOKUP(D232,Impactos!$A$2:$C$21,3)","v":"Mejora de la salud y bienestar"},"CB116",2]
["CB2","BOSQUE URBANO","BIODIVERSIDAD",16,{"$f":"VLOOKUP(D233,Impactos!$A$2:$C$21,3)","v":"Mejora de la salud y bienestar"},"CB216",3]
["CB3","JARDINES EDUCATIVOS","BIODIVERSIDAD",16,{"$f":"VLOOKUP(D234,Impactos!$A$2:$C$21,3)","v":"Mejora de la salud y bienestar"},"CB316",3]
["CB4","HUERTOS URBANOS","BIODIVERSIDAD",16,{"$f":"VLOOKUP(D235,Impactos!$A$2:$C$21,3)","v":"Mejora de la salud y bienestar"},"CB416",3]
["CB5","RENATURALIZACION DE ELEMENTOS FLUVIALES","BIODIVERSIDAD",16,{"$f":"VLOOKUP(D236,Impactos!$A$2:$C$21,3)","v":"Mejora de la salud y bienestar"},"CB516",2]
["CB6","DESENTUBADO DE RIOS","BIODIVERSIDAD",16,{"$f":"VLOOKUP(D237,Impactos!$A$2:$C$21,3)","v":"Mejora de la salud y bienestar"},"CB616",2]
["CB1","ARBOLADO","BIODIVERSIDAD",17,{"$f":"VLOOKUP(D238,Impactos!$A$2:$C$21,3)","v":"Generación de recursos comunitarios (fortalecimiento de la ciudadanía)"},"CB117",3]
["CB2","BOSQUE URBANO","BIODIVERSIDAD",17,{"$f":"VLOOKUP(D239,Impactos!$A$2:$C$21,3)","v":"Generación de recursos comunitarios (fortalecimiento de la ciudadanía)"},"CB217",3]
["CB3","JARDINES EDUCATIVOS","BIODIVERSIDAD",17,{"$f":"VLOOKUP(D240,Impactos!$A$2:$C$21,3)","v":"Generación de recursos comunitarios (fortalecimiento de la ciudadanía)"},"CB317",3]
["CB4","HUERTOS URBANOS","BIODIVERSIDAD",17,{"$f":"VLOOKUP(D241,Impactos!$A$2:$C$21,3)","v":"Generación de recursos comunitarios (fortalecimiento de la ciudadanía)"},"CB417",3]
["CB5","RENATURALIZACION DE ELEMENTOS FLUVIALES","BIODIVERSIDAD",17,{"$f":"VLOOKUP(D242,Impactos!$A$2:$C$21,3)","v":"Generación de recursos comunitarios (fortalecimiento de la ciudadanía)"},"CB517",2]
["CB6","DESENTUBADO DE RIOS","BIODIVERSIDAD",17,{"$f":"VLOOKUP(D243,Impactos!$A$2:$C$21,3)","v":"Generación de recursos comunitarios (fortalecimiento de la ciudadanía)"},"CB617",3]
["CB1","ARBOLADO","BIODIVERSIDAD",18,{"$f":"VLOOKUP(D244,Impactos!$A$2:$C$21,3)","v":"Fortalecimiento de sentimiento de pertenencia e identidad"},"CB118",2]
["CB2","BOSQUE URBANO","BIODIVERSIDAD",18,{"$f":"VLOOKUP(D245,Impactos!$A$2:$C$21,3)","v":"Fortalecimiento de sentimiento de pertenencia e identidad"},"CB218",3]
["CB3","JARDINES EDUCATIVOS","BIODIVERSIDAD",18,{"$f":"VLOOKUP(D246,Impactos!$A$2:$C$21,3)","v":"Fortalecimiento de sentimiento de pertenencia e identidad"},"CB318",3]
["CB4","HUERTOS URBANOS","BIODIVERSIDAD",18,{"$f":"VLOOKUP(D247,Impactos!$A$2:$C$21,3)","v":"Fortalecimiento de sentimiento de pertenencia e identidad"},"CB418",3]
["CB5","RENATURALIZACION DE ELEMENTOS FLUVIALES","BIODIVERSIDAD",18,{"$f":"VLOOKUP(D248,Impactos!$A$2:$C$21,3)","v":"Fortalecimiento de sentimiento de pertenencia e identidad"},"CB518",2]
["CB6","DESENTUBADO DE RIOS","BIODIVERSIDAD",18,{"$f":"VLOOKUP(D249,Impactos!$A$2:$C$21,3)","v":"Fortalecimiento de sentimiento de pertenencia e identidad"},"CB618",2]
["CB1","ARBOLADO","BIODIVERSIDAD",19,{"$f":"VLOOKUP(D250,Impactos!$A$2:$C$21,3)","v":"Optimización de la inversión pública "},"CB119",1]
["CB2","BOSQUE URBANO","BIODIVERSIDAD",19,{"$f":"VLOOKUP(D251,Impactos!$A$2:$C$21,3)","v":"Optimización de la inversión pública "},"CB219",3]
["CB3","JARDINES EDUCATIVOS","BIODIVERSIDAD",19,{"$f":"VLOOKUP(D252,Impactos!$A$2:$C$21,3)","v":"Optimización de la inversión pública "},"CB319",3]
["CB4","HUERTOS URBANOS","BIODIVERSIDAD",19,{"$f":"VLOOKUP(D253,Impactos!$A$2:$C$21,3)","v":"Optimización de la inversión pública "},"CB419",3]
["CB5","RENATURALIZACION DE ELEMENTOS FLUVIALES","BIODIVERSIDAD",19,{"$f":"VLOOKUP(D254,Impactos!$A$2:$C$21,3)","v":"Optimización de la inversión pública "},"CB519",3]
["CB6","DESENTUBADO DE RIOS","BIODIVERSIDAD",19,{"$f":"VLOOKUP(D255,Impactos!$A$2:$C$21,3)","v":"Optimización de la inversión pública "},"CB619",3]
["CB1","ARBOLADO","BIODIVERSIDAD",20,{"$f":"VLOOKUP(D256,Impactos!$A$2:$C$21,3)","v":"Atracción para negocios, turismo y economía verde"},"CB120",1]
["CB2","BOSQUE URBANO","BIODIVERSIDAD",20,{"$f":"VLOOKUP(D257,Impactos!$A$2:$C$21,3)","v":"Atracción para negocios, turismo y economía verde"},"CB220",3]
["CB3","JARDINES EDUCATIVOS","BIODIVERSIDAD",20,{"$f":"VLOOKUP(D258,Impactos!$A$2:$C$21,3)","v":"Atracción para negocios, turismo y economía verde"},"CB320",3]
["CB4","HUERTOS URBANOS","BIODIVERSIDAD",20,{"$f":"VLOOKUP(D259,Impactos!$A$2:$C$21,3)","v":"Atracción para negocios, turismo y economía verde"},"CB420",3]
["CB5","RENATURALIZACION DE ELEMENTOS FLUVIALES","BIODIVERSIDAD",20,{"$f":"VLOOKUP(D260,Impactos!$A$2:$C$21,3)","v":"Atracción para negocios, turismo y economía verde"},"CB520",3]
["CB6","DESENTUBADO DE RIOS","BIODIVERSIDAD",20,{"$f":"VLOOKUP(D261,Impactos!$A$2:$C$21,3)","v":"Atracción para negocios, turismo y economía verde"},"CB620",3]
["CEP1","MOBILIARIO URBANO SOSTENIBLE","ESPACIO URBANO",1,{"$f":"VLOOKUP(D262,Impactos!$A$2:$C$21,3)","v":"Prevención de inundaciones, regulación de escorrentías"},"CEP11",0]
["CEP2","MOBILIARIO HIDRÁULICO CERTIFICADO","ESPACIO URBANO",1,{"$f":"VLOOKUP(D263,Impactos!$A$2:$C$21,3)","v":"Prevención de inundaciones, regulación de escorrentías"},"CEP21",0]
["CEP3","LUMINARIAS  SUSTENTABLES","ESPACIO URBANO",1,{"$f":"VLOOKUP(D264,Impactos!$A$2:$C$21,3)","v":"Prevención de inundaciones, regulación de escorrentías"},"CEP31",0]
["CEP4","PAVIMENTOS RECICLADOS","ESPACIO URBANO",1,{"$f":"VLOOKUP(D265,Impactos!$A$2:$C$21,3)","v":"Prevención de inundaciones, regulación de escorrentías"},"CEP41",0]
["CEP5","ELEMENTOS DE SOMBREAMIENTO","ESPACIO URBANO",1,{"$f":"VLOOKUP(D266,Impactos!$A$2:$C$21,3)","v":"Prevención de inundaciones, regulación de escorrentías"},"CEP51",0]
["CEP1","MOBILIARIO URBANO SOSTENIBLE","ESPACIO URBANO",2,{"$f":"VLOOKUP(D267,Impactos!$A$2:$C$21,3)","v":"Reducción de los riesgos derivados de las inundaciones, regulación de avenidas."},"CEP12",0]
["CEP2","MOBILIARIO HIDRÁULICO CERTIFICADO","ESPACIO URBANO",2,{"$f":"VLOOKUP(D268,Impactos!$A$2:$C$21,3)","v":"Reducción de los riesgos derivados de las inundaciones, regulación de avenidas."},"CEP22",0]
["CEP3","LUMINARIAS  SUSTENTABLES","ESPACIO URBANO",2,{"$f":"VLOOKUP(D269,Impactos!$A$2:$C$21,3)","v":"Reducción de los riesgos derivados de las inundaciones, regulación de avenidas."},"CEP32",0]
["CEP4","PAVIMENTOS RECICLADOS","ESPACIO URBANO",2,{"$f":"VLOOKUP(D270,Impactos!$A$2:$C$21,3)","v":"Reducción de los riesgos derivados de las inundaciones, regulación de avenidas."},"CEP42",1]
["CEP5","ELEMENTOS DE SOMBREAMIENTO","ESPACIO URBANO",2,{"$f":"VLOOKUP(D271,Impactos!$A$2:$C$21,3)","v":"Reducción de los riesgos derivados de las inundaciones, regulación de avenidas."},{"$f":"CONCATENATE(A271,D271)","v":"CEP52"},0]
["CEP1","MOBILIARIO URBANO SOSTENIBLE","ESPACIO URBANO",3,{"$f":"VLOOKUP(D272,Impactos!$A$2:$C$21,3)","v":"Incremento de la recarga de agua de los acuíferos"},"CEP13",0]
["CEP2","MOBILIARIO HIDRÁULICO CERTIFICADO","ESPACIO URBANO",3,{"$f":"VLOOKUP(D273,Impactos!$A$2:$C$21,3)","v":"Incremento de la recarga de agua de los acuíferos"},"CEP23",0]
["CEP3","LUMINARIAS  SUSTENTABLES","ESPACIO URBANO",3,{"$f":"VLOOKUP(D274,Impactos!$A$2:$C$21,3)","v":"Incremento de la recarga de agua de los acuíferos"},"CEP33",0]
["CEP4","PAVIMENTOS RECICLADOS","ESPACIO URBANO",3,{"$f":"VLOOKUP(D275,Impactos!$A$2:$C$21,3)","v":"Incremento de la recarga de agua de los acuíferos"},"CEP43",1]
["CEP5","ELEMENTOS DE SOMBREAMIENTO","ESPACIO URBANO",3,{"$f":"VLOOKUP(D276,Impactos!$A$2:$C$21,3)","v":"Incremento de la recarga de agua de los acuíferos"},"CEP53",0]
["CEP1","MOBILIARIO URBANO SOSTENIBLE","ESPACIO URBANO",4,{"$f":"VLOOKUP(D277,Impactos!$A$2:$C$21,3)","v":"Regulación térmica y disminución de las islas urbanas de calor"},"CEP14",0]
["CEP2","MOBILIARIO HIDRÁULICO CERTIFICADO","ESPACIO URBANO",4,{"$f":"VLOOKUP(D278,Impactos!$A$2:$C$21,3)","v":"Regulación térmica y disminución de las islas urbanas de calor"},"CEP24",0]
["CEP3","LUMINARIAS  SUSTENTABLES","ESPACIO URBANO",4,{"$f":"VLOOKUP(D279,Impactos!$A$2:$C$21,3)","v":"Regulación térmica y disminución de las islas urbanas de calor"},"CEP34",0]
["CEP4","PAVIMENTOS RECICLADOS","ESPACIO URBANO",4,{"$f":"VLOOKUP(D280,Impactos!$A$2:$C$21,3)","v":"Regulación térmica y disminución de las islas urbanas de calor"},"CEP44",1]
["CEP5","ELEMENTOS DE SOMBREAMIENTO","ESPACIO URBANO",4,{"$f":"VLOOKUP(D281,Impactos!$A$2:$C$21,3)","v":"Regulación térmica y disminución de las islas urbanas de calor"},"CEP54",3]
["CEP1","MOBILIARIO URBANO SOSTENIBLE","ESPACIO URBANO",5,{"$f":"VLOOKUP(D282,Impactos!$A$2:$C$21,3)","v":"Mejora de la conectividad ecológica."},"CEP15",0]
["CEP2","MOBILIARIO HIDRÁULICO CERTIFICADO","ESPACIO URBANO",5,{"$f":"VLOOKUP(D283,Impactos!$A$2:$C$21,3)","v":"Mejora de la conectividad ecológica."},"CEP25",0]
["CEP3","LUMINARIAS  SUSTENTABLES","ESPACIO URBANO",5,{"$f":"VLOOKUP(D284,Impactos!$A$2:$C$21,3)","v":"Mejora de la conectividad ecológica."},"CEP35",0]
["CEP4","PAVIMENTOS RECICLADOS","ESPACIO URBANO",5,{"$f":"VLOOKUP(D285,Impactos!$A$2:$C$21,3)","v":"Mejora de la conectividad ecológica."},"CEP45",0]
["CEP5","ELEMENTOS DE SOMBREAMIENTO","ESPACIO URBANO",5,{"$f":"VLOOKUP(D286,Impactos!$A$2:$C$21,3)","v":"Mejora de la conectividad ecológica."},"CEP55",0]
["CEP1","MOBILIARIO URBANO SOSTENIBLE","ESPACIO URBANO",6,{"$f":"VLOOKUP(D287,Impactos!$A$2:$C$21,3)","v":"Secuestro de carbono "},"CEP16",0]
["CEP2","MOBILIARIO HIDRÁULICO CERTIFICADO","ESPACIO URBANO",6,{"$f":"VLOOKUP(D288,Impactos!$A$2:$C$21,3)","v":"Secuestro de carbono "},"CEP26",0]
["CEP3","LUMINARIAS  SUSTENTABLES","ESPACIO URBANO",6,{"$f":"VLOOKUP(D289,Impactos!$A$2:$C$21,3)","v":"Secuestro de carbono "},"CEP36",0]
["CEP4","PAVIMENTOS RECICLADOS","ESPACIO URBANO",6,{"$f":"VLOOKUP(D290,Impactos!$A$2:$C$21,3)","v":"Secuestro de carbono "},"CEP46",0]
["CEP5","ELEMENTOS DE SOMBREAMIENTO","ESPACIO URBANO",6,{"$f":"VLOOKUP(D291,Impactos!$A$2:$C$21,3)","v":"Secuestro de carbono "},"CEP56",1]
["CEP1","MOBILIARIO URBANO SOSTENIBLE","ESPACIO URBANO",7,{"$f":"VLOOKUP(D292,Impactos!$A$2:$C$21,3)","v":"Reducción de emisiones de GEI"},"CEP17",1]
["CEP2","MOBILIARIO HIDRÁULICO CERTIFICADO","ESPACIO URBANO",7,{"$f":"VLOOKUP(D293,Impactos!$A$2:$C$21,3)","v":"Reducción de emisiones de GEI"},"CEP27",0]
["CEP3","LUMINARIAS  SUSTENTABLES","ESPACIO URBANO",7,{"$f":"VLOOKUP(D294,Impactos!$A$2:$C$21,3)","v":"Reducción de emisiones de GEI"},"CEP37",3]
["CEP4","PAVIMENTOS RECICLADOS","ESPACIO URBANO",7,{"$f":"VLOOKUP(D295,Impactos!$A$2:$C$21,3)","v":"Reducción de emisiones de GEI"},"CEP47",2]
["CEP5","ELEMENTOS DE SOMBREAMIENTO","ESPACIO URBANO",7,{"$f":"VLOOKUP(D296,Impactos!$A$2:$C$21,3)","v":"Reducción de emisiones de GEI"},"CEP57",0]
["CEP1","MOBILIARIO URBANO SOSTENIBLE","ESPACIO URBANO",8,{"$f":"VLOOKUP(D297,Impactos!$A$2:$C$21,3)","v":"Mejora de la calidad del aire"},"CEP18",1]
["CEP2","MOBILIARIO HIDRÁULICO CERTIFICADO","ESPACIO URBANO",8,{"$f":"VLOOKUP(D298,Impactos!$A$2:$C$21,3)","v":"Mejora de la calidad del aire"},"CEP28",0]
["CEP3","LUMINARIAS  SUSTENTABLES","ESPACIO URBANO",8,{"$f":"VLOOKUP(D299,Impactos!$A$2:$C$21,3)","v":"Mejora de la calidad del aire"},"CEP38",0]
["CEP4","PAVIMENTOS RECICLADOS","ESPACIO URBANO",8,{"$f":"VLOOKUP(D300,Impactos!$A$2:$C$21,3)","v":"Mejora de la calidad del aire"},"CEP48",1]
["CEP5","ELEMENTOS DE SOMBREAMIENTO","ESPACIO URBANO",8,{"$f":"VLOOKUP(D301,Impactos!$A$2:$C$21,3)","v":"Mejora de la calidad del aire"},"CEP58",0]
["CEP1","MOBILIARIO URBANO SOSTENIBLE","ESPACIO URBANO",9,{"$f":"VLOOKUP(D302,Impactos!$A$2:$C$21,3)","v":"Mejora de la calidad del agua (purificación del agua)"},"CEP19",0]
["CEP2","MOBILIARIO HIDRÁULICO CERTIFICADO","ESPACIO URBANO",9,{"$f":"VLOOKUP(D303,Impactos!$A$2:$C$21,3)","v":"Mejora de la calidad del agua (purificación del agua)"},"CEP29",1]
["CEP3","LUMINARIAS  SUSTENTABLES","ESPACIO URBANO",9,{"$f":"VLOOKUP(D304,Impactos!$A$2:$C$21,3)","v":"Mejora de la calidad del agua (purificación del agua)"},"CEP39",0]
["CEP4","PAVIMENTOS RECICLADOS","ESPACIO URBANO",9,{"$f":"VLOOKUP(D305,Impactos!$A$2:$C$21,3)","v":"Mejora de la calidad del agua (purificación del agua)"},"CEP49",1]
["CEP5","ELEMENTOS DE SOMBREAMIENTO","ESPACIO URBANO",9,{"$f":"VLOOKUP(D306,Impactos!$A$2:$C$21,3)","v":"Mejora de la calidad del agua (purificación del agua)"},"CEP59",0]
["CEP1","MOBILIARIO URBANO SOSTENIBLE","ESPACIO URBANO",10,{"$f":"VLOOKUP(D307,Impactos!$A$2:$C$21,3)","v":"Reducción de la contaminación por ruido"},"CEP110",1]
["CEP2","MOBILIARIO HIDRÁULICO CERTIFICADO","ESPACIO URBANO",10,{"$f":"VLOOKUP(D308,Impactos!$A$2:$C$21,3)","v":"Reducción de la contaminación por ruido"},"CEP210",0]
["CEP3","LUMINARIAS  SUSTENTABLES","ESPACIO URBANO",10,{"$f":"VLOOKUP(D309,Impactos!$A$2:$C$21,3)","v":"Reducción de la contaminación por ruido"},"CEP310",0]
["CEP4","PAVIMENTOS RECICLADOS","ESPACIO URBANO",10,{"$f":"VLOOKUP(D310,Impactos!$A$2:$C$21,3)","v":"Reducción de la contaminación por ruido"},"CEP410",0]
["CEP5","ELEMENTOS DE SOMBREAMIENTO","ESPACIO URBANO",10,{"$f":"VLOOKUP(D311,Impactos!$A$2:$C$21,3)","v":"Reducción de la contaminación por ruido"},"CEP510",0]
["CEP1","MOBILIARIO URBANO SOSTENIBLE","ESPACIO URBANO",11,{"$f":"VLOOKUP(D312,Impactos!$A$2:$C$21,3)","v":"Control de la erosión del suelo"},"CEP111",0]
["CEP2","MOBILIARIO HIDRÁULICO CERTIFICADO","ESPACIO URBANO",11,{"$f":"VLOOKUP(D313,Impactos!$A$2:$C$21,3)","v":"Control de la erosión del suelo"},"CEP211",0]
["CEP3","LUMINARIAS  SUSTENTABLES","ESPACIO URBANO",11,{"$f":"VLOOKUP(D314,Impactos!$A$2:$C$21,3)","v":"Control de la erosión del suelo"},"CEP311",0]
["CEP4","PAVIMENTOS RECICLADOS","ESPACIO URBANO",11,{"$f":"VLOOKUP(D315,Impactos!$A$2:$C$21,3)","v":"Control de la erosión del suelo"},"CEP411",0]
["CEP5","ELEMENTOS DE SOMBREAMIENTO","ESPACIO URBANO",11,{"$f":"VLOOKUP(D316,Impactos!$A$2:$C$21,3)","v":"Control de la erosión del suelo"},"CEP511",0]
["CEP1","MOBILIARIO URBANO SOSTENIBLE","ESPACIO URBANO",12,{"$f":"VLOOKUP(D317,Impactos!$A$2:$C$21,3)","v":"Mantenimiento, protección y mejora de hábitats, vida silvestre y biodiversidad"},"CEP112",0]
["CEP2","MOBILIARIO HIDRÁULICO CERTIFICADO","ESPACIO URBANO",12,{"$f":"VLOOKUP(D318,Impactos!$A$2:$C$21,3)","v":"Mantenimiento, protección y mejora de hábitats, vida silvestre y biodiversidad"},"CEP212",0]
["CEP3","LUMINARIAS  SUSTENTABLES","ESPACIO URBANO",12,{"$f":"VLOOKUP(D319,Impactos!$A$2:$C$21,3)","v":"Mantenimiento, protección y mejora de hábitats, vida silvestre y biodiversidad"},"CEP312",0]
["CEP4","PAVIMENTOS RECICLADOS","ESPACIO URBANO",12,{"$f":"VLOOKUP(D320,Impactos!$A$2:$C$21,3)","v":"Mantenimiento, protección y mejora de hábitats, vida silvestre y biodiversidad"},"CEP412",0]
["CEP5","ELEMENTOS DE SOMBREAMIENTO","ESPACIO URBANO",12,{"$f":"VLOOKUP(D321,Impactos!$A$2:$C$21,3)","v":"Mantenimiento, protección y mejora de hábitats, vida silvestre y biodiversidad"},"CEP512",0]
["CEP1","MOBILIARIO URBANO SOSTENIBLE","ESPACIO URBANO",13,{"$f":"VLOOKUP(D322,Impactos!$A$2:$C$21,3)","v":"Producción de servicios ecosistémicos"},"CEP113",0]
["CEP2","MOBILIARIO HIDRÁULICO CERTIFICADO","ESPACIO URBANO",13,{"$f":"VLOOKUP(D323,Impactos!$A$2:$C$21,3)","v":"Producción de servicios ecosistémicos"},"CEP213",0]
["CEP3","LUMINARIAS  SUSTENTABLES","ESPACIO URBANO",13,{"$f":"VLOOKUP(D324,Impactos!$A$2:$C$21,3)","v":"Producción de servicios ecosistémicos"},"CEP313",0]
["CEP4","PAVIMENTOS RECICLADOS","ESPACIO URBANO",13,{"$f":"VLOOKUP(D325,Impactos!$A$2:$C$21,3)","v":"Producción de servicios ecosistémicos"},"CEP413",1]
["CEP5","ELEMENTOS DE SOMBREAMIENTO","ESPACIO URBANO",13,{"$f":"VLOOKUP(D326,Impactos!$A$2:$C$21,3)","v":"Producción de servicios ecosistémicos"},"CEP513",0]
["CEP1","MOBILIARIO URBANO SOSTENIBLE","ESPACIO URBANO",14,{"$f":"VLOOKUP(D327,Impactos!$A$2:$C$21,3)","v":"Mejora de los valores estéticos"},"CEP114",3]
["CEP2","MOBILIARIO HIDRÁULICO CERTIFICADO","ESPACIO URBANO",14,{"$f":"VLOOKUP(D328,Impactos!$A$2:$C$21,3)","v":"Mejora de los valores estéticos"},"CEP214",0]
["CEP3","LUMINARIAS  SUSTENTABLES","ESPACIO URBANO",14,{"$f":"VLOOKUP(D329,Impactos!$A$2:$C$21,3)","v":"Mejora de los valores estéticos"},"CEP314",3]
["CEP4","PAVIMENTOS RECICLADOS","ESPACIO URBANO",14,{"$f":"VLOOKUP(D330,Impactos!$A$2:$C$21,3)","v":"Mejora de los valores estéticos"},"CEP414",2]
["CEP5","ELEMENTOS DE SOMBREAMIENTO","ESPACIO URBANO",14,{"$f":"VLOOKUP(D331,Impactos!$A$2:$C$21,3)","v":"Mejora de los valores estéticos"},"CEP514",2]
["CEP1","MOBILIARIO URBANO SOSTENIBLE","ESPACIO URBANO",15,{"$f":"VLOOKUP(D332,Impactos!$A$2:$C$21,3)","v":"Mejora accesibilidad de recursos para deporte, cultura, formación y recreación"},"CEP115",3]
["CEP2","MOBILIARIO HIDRÁULICO CERTIFICADO","ESPACIO URBANO",15,{"$f":"VLOOKUP(D333,Impactos!$A$2:$C$21,3)","v":"Mejora accesibilidad de recursos para deporte, cultura, formación y recreación"},"CEP215",2]
["CEP3","LUMINARIAS  SUSTENTABLES","ESPACIO URBANO",15,{"$f":"VLOOKUP(D334,Impactos!$A$2:$C$21,3)","v":"Mejora accesibilidad de recursos para deporte, cultura, formación y recreación"},"CEP315",3,null,null,"¿Permite un uso del espacio público en horarios vespertinos y nocturnos?"]
["CEP4","PAVIMENTOS RECICLADOS","ESPACIO URBANO",15,{"$f":"VLOOKUP(D335,Impactos!$A$2:$C$21,3)","v":"Mejora accesibilidad de recursos para deporte, cultura, formación y recreación"},{"$f":"CONCATENATE(A335,D335)","v":"CEP415"},1]
["CEP5","ELEMENTOS DE SOMBREAMIENTO","ESPACIO URBANO",15,{"$f":"VLOOKUP(D336,Impactos!$A$2:$C$21,3)","v":"Mejora accesibilidad de recursos para deporte, cultura, formación y recreación"},"CEP515",2]
["CEP1","MOBILIARIO URBANO SOSTENIBLE","ESPACIO URBANO",16,{"$f":"VLOOKUP(D337,Impactos!$A$2:$C$21,3)","v":"Mejora de la salud y bienestar"},"CEP116",2]
["CEP2","MOBILIARIO HIDRÁULICO CERTIFICADO","ESPACIO URBANO",16,{"$f":"VLOOKUP(D338,Impactos!$A$2:$C$21,3)","v":"Mejora de la salud y bienestar"},"CEP216",2]
["CEP3","LUMINARIAS  SUSTENTABLES","ESPACIO URBANO",16,{"$f":"VLOOKUP(D339,Impactos!$A$2:$C$21,3)","v":"Mejora de la salud y bienestar"},"CEP316",0]
["CEP4","PAVIMENTOS RECICLADOS","ESPACIO URBANO",16,{"$f":"VLOOKUP(D340,Impactos!$A$2:$C$21,3)","v":"Mejora de la salud y bienestar"},"CEP416",0]
["CEP5","ELEMENTOS DE SOMBREAMIENTO","ESPACIO URBANO",16,{"$f":"VLOOKUP(D341,Impactos!$A$2:$C$21,3)","v":"Mejora de la salud y bienestar"},"CEP516",0]
["CEP1","MOBILIARIO URBANO SOSTENIBLE","ESPACIO URBANO",17,{"$f":"VLOOKUP(D342,Impactos!$A$2:$C$21,3)","v":"Generación de recursos comunitarios (fortalecimiento de la ciudadanía)"},"CEP117",3]
["CEP2","MOBILIARIO HIDRÁULICO CERTIFICADO","ESPACIO URBANO",17,{"$f":"VLOOKUP(D343,Impactos!$A$2:$C$21,3)","v":"Generación de recursos comunitarios (fortalecimiento de la ciudadanía)"},"CEP217",0]
["CEP3","LUMINARIAS  SUSTENTABLES","ESPACIO URBANO",17,{"$f":"VLOOKUP(D344,Impactos!$A$2:$C$21,3)","v":"Generación de recursos comunitarios (fortalecimiento de la ciudadanía)"},"CEP317",3]
["CEP4","PAVIMENTOS RECICLADOS","ESPACIO URBANO",17,{"$f":"VLOOKUP(D345,Impactos!$A$2:$C$21,3)","v":"Generación de recursos comunitarios (fortalecimiento de la ciudadanía)"},"CEP417",0]
["CEP5","ELEMENTOS DE SOMBREAMIENTO","ESPACIO URBANO",17,{"$f":"VLOOKUP(D346,Impactos!$A$2:$C$21,3)","v":"Generación de recursos comunitarios (fortalecimiento de la ciudadanía)"},"CEP517",2]
["CEP1","MOBILIARIO URBANO SOSTENIBLE","ESPACIO URBANO",18,{"$f":"VLOOKUP(D347,Impactos!$A$2:$C$21,3)","v":"Fortalecimiento de sentimiento de pertenencia e identidad"},"CEP118",1]
["CEP2","MOBILIARIO HIDRÁULICO CERTIFICADO","ESPACIO URBANO",18,{"$f":"VLOOKUP(D348,Impactos!$A$2:$C$21,3)","v":"Fortalecimiento de sentimiento de pertenencia e identidad"},"CEP218",0]
["CEP3","LUMINARIAS  SUSTENTABLES","ESPACIO URBANO",18,{"$f":"VLOOKUP(D349,Impactos!$A$2:$C$21,3)","v":"Fortalecimiento de sentimiento de pertenencia e identidad"},"CEP318",2]
["CEP4","PAVIMENTOS RECICLADOS","ESPACIO URBANO",18,{"$f":"VLOOKUP(D350,Impactos!$A$2:$C$21,3)","v":"Fortalecimiento de sentimiento de pertenencia e identidad"},"CEP418",0]
["CEP5","ELEMENTOS DE SOMBREAMIENTO","ESPACIO URBANO",18,{"$f":"VLOOKUP(D351,Impactos!$A$2:$C$21,3)","v":"Fortalecimiento de sentimiento de pertenencia e identidad"},"CEP518",0]
["CEP1","MOBILIARIO URBANO SOSTENIBLE","ESPACIO URBANO",19,{"$f":"VLOOKUP(D352,Impactos!$A$2:$C$21,3)","v":"Optimización de la inversión pública "},"CEP119",0]
["CEP2","MOBILIARIO HIDRÁULICO CERTIFICADO","ESPACIO URBANO",19,{"$f":"VLOOKUP(D353,Impactos!$A$2:$C$21,3)","v":"Optimización de la inversión pública "},"CEP219",0]
["CEP3","LUMINARIAS  SUSTENTABLES","ESPACIO URBANO",19,{"$f":"VLOOKUP(D354,Impactos!$A$2:$C$21,3)","v":"Optimización de la inversión pública "},"CEP319",0]
["CEP4","PAVIMENTOS RECICLADOS","ESPACIO URBANO",19,{"$f":"VLOOKUP(D355,Impactos!$A$2:$C$21,3)","v":"Optimización de la inversión pública "},"CEP419",0]
["CEP5","ELEMENTOS DE SOMBREAMIENTO","ESPACIO URBANO",19,{"$f":"VLOOKUP(D356,Impactos!$A$2:$C$21,3)","v":"Optimización de la inversión pública "},"CEP519",0]
["CEP1","MOBILIARIO URBANO SOSTENIBLE","ESPACIO URBANO",20,{"$f":"VLOOKUP(D357,Impactos!$A$2:$C$21,3)","v":"Atracción para negocios, turismo y economía verde"},"CEP120",3]
["CEP2","MOBILIARIO HIDRÁULICO CERTIFICADO","ESPACIO URBANO",20,{"$f":"VLOOKUP(D358,Impactos!$A$2:$C$21,3)","v":"Atracción para negocios, turismo y economía verde"},"CEP220",1]
["CEP3","LUMINARIAS  SUSTENTABLES","ESPACIO URBANO",20,{"$f":"VLOOKUP(D359,Impactos!$A$2:$C$21,3)","v":"Atracción para negocios, turismo y economía verde"},"CEP320",0]
["CEP4","PAVIMENTOS RECICLADOS","ESPACIO URBANO",20,{"$f":"VLOOKUP(D360,Impactos!$A$2:$C$21,3)","v":"Atracción para negocios, turismo y economía verde"},"CEP420",1]
["CEP5","ELEMENTOS DE SOMBREAMIENTO","ESPACIO URBANO",20,{"$f":"VLOOKUP(D361,Impactos!$A$2:$C$21,3)","v":"Atracción para negocios, turismo y economía verde"},"CEP520",0]
["CMO2","CICLOVIAS","MOVILIDAD",1,{"$f":"VLOOKUP(D362,Impactos!$A$2:$C$21,3)","v":"Prevención de inundaciones, regulación de escorrentías"},"CMO21",1]
["CMO3","CORREDOR PEATONAL ARBOLADO","MOVILIDAD",1,{"$f":"VLOOKUP(D363,Impactos!$A$2:$C$21,3)","v":"Prevención de inundaciones, regulación de escorrentías"},"CMO31",0]
["CMO1","URBANISMO TÁCTICO","MOVILIDAD",1,{"$f":"VLOOKUP(D364,Impactos!$A$2:$C$21,3)","v":"Prevención de inundaciones, regulación de escorrentías"},"CMO11",0]
["CMO4","BANQUETAS","MOVILIDAD",1,{"$f":"VLOOKUP(D365,Impactos!$A$2:$C$21,3)","v":"Prevención de inundaciones, regulación de escorrentías"},"CMO41",2]
["CMO5","ZONA TRANSPORTE PÚBLICO","MOVILIDAD",1,{"$f":"VLOOKUP(D366,Impactos!$A$2:$C$21,3)","v":"Prevención de inundaciones, regulación de escorrentías"},"CMO51",0]
["CMO6","ZONA CARGA SOSTENIBLE","MOVILIDAD",1,{"$f":"VLOOKUP(D367,Impactos!$A$2:$C$21,3)","v":"Prevención de inundaciones, regulación de escorrentías"},"CMO61",0]
["CMO7","ZONA VEHÍCULO PRIVADO SOSTENIBLE","MOVILIDAD",1,{"$f":"VLOOKUP(D368,Impactos!$A$2:$C$21,3)","v":"Prevención de inundaciones, regulación de escorrentías"},"CMO71",0]
["CMO2","CICLOVIAS","MOVILIDAD",2,{"$f":"VLOOKUP(D369,Impactos!$A$2:$C$21,3)","v":"Reducción de los riesgos derivados de las inundaciones, regulación de avenidas."},"CMO22",0]
["CMO3","CORREDOR PEATONAL ARBOLADO","MOVILIDAD",2,{"$f":"VLOOKUP(D370,Impactos!$A$2:$C$21,3)","v":"Reducción de los riesgos derivados de las inundaciones, regulación de avenidas."},"CMO32",0]
["CMO1","URBANISMO TÁCTICO","MOVILIDAD",2,{"$f":"VLOOKUP(D371,Impactos!$A$2:$C$21,3)","v":"Reducción de los riesgos derivados de las inundaciones, regulación de avenidas."},"CMO12",0]
["CMO4","BANQUETAS","MOVILIDAD",2,{"$f":"VLOOKUP(D372,Impactos!$A$2:$C$21,3)","v":"Reducción de los riesgos derivados de las inundaciones, regulación de avenidas."},"CMO42",2]
["CMO5","ZONA TRANSPORTE PÚBLICO","MOVILIDAD",2,{"$f":"VLOOKUP(D373,Impactos!$A$2:$C$21,3)","v":"Reducción de los riesgos derivados de las inundaciones, regulación de avenidas."},"CMO52",0]
["CMO6","ZONA CARGA SOSTENIBLE","MOVILIDAD",2,{"$f":"VLOOKUP(D374,Impactos!$A$2:$C$21,3)","v":"Reducción de los riesgos derivados de las inundaciones, regulación de avenidas."},"CMO62",0]
["CMO7","ZONA VEHÍCULO PRIVADO SOSTENIBLE","MOVILIDAD",2,{"$f":"VLOOKUP(D375,Impactos!$A$2:$C$21,3)","v":"Reducción de los riesgos derivados de las inundaciones, regulación de avenidas."},"CMO72",0]
["CMO2","CICLOVIAS","MOVILIDAD",3,{"$f":"VLOOKUP(D376,Impactos!$A$2:$C$21,3)","v":"Incremento de la recarga de agua de los acuíferos"},"CMO23",1]
["CMO3","CORREDOR PEATONAL ARBOLADO","MOVILIDAD",3,{"$f":"VLOOKUP(D377,Impactos!$A$2:$C$21,3)","v":"Incremento de la recarga de agua de los acuíferos"},"CMO33",0]
["CMO1","URBANISMO TÁCTICO","MOVILIDAD",3,{"$f":"VLOOKUP(D378,Impactos!$A$2:$C$21,3)","v":"Incremento de la recarga de agua de los acuíferos"},"CMO13",0]
["CMO4","BANQUETAS","MOVILIDAD",3,{"$f":"VLOOKUP(D379,Impactos!$A$2:$C$21,3)","v":"Incremento de la recarga de agua de los acuíferos"},"CMO43",2]
["CMO5","ZONA TRANSPORTE PÚBLICO","MOVILIDAD",3,{"$f":"VLOOKUP(D380,Impactos!$A$2:$C$21,3)","v":"Incremento de la recarga de agua de los acuíferos"},"CMO53",0]
["CMO6","ZONA CARGA SOSTENIBLE","MOVILIDAD",3,{"$f":"VLOOKUP(D381,Impactos!$A$2:$C$21,3)","v":"Incremento de la recarga de agua de los acuíferos"},"CMO63",0]
["CMO7","ZONA VEHÍCULO PRIVADO SOSTENIBLE","MOVILIDAD",3,{"$f":"VLOOKUP(D382,Impactos!$A$2:$C$21,3)","v":"Incremento de la recarga de agua de los acuíferos"},"CMO73",0]
["CMO2","CICLOVIAS","MOVILIDAD",4,{"$f":"VLOOKUP(D383,Impactos!$A$2:$C$21,3)","v":"Regulación térmica y disminución de las islas urbanas de calor"},"CMO24",1,1,null,"¿Disuade el uso del automóvil?"]
["CMO3","CORREDOR PEATONAL ARBOLADO","MOVILIDAD",4,{"$f":"VLOOKUP(D384,Impactos!$A$2:$C$21,3)","v":"Regulación térmica y disminución de las islas urbanas de calor"},"CMO34",0]
["CMO1","URBANISMO TÁCTICO","MOVILIDAD",4,{"$f":"VLOOKUP(D385,Impactos!$A$2:$C$21,3)","v":"Regulación térmica y disminución de las islas urbanas de calor"},"CMO14",1]
["CMO4","BANQUETAS","MOVILIDAD",4,{"$f":"VLOOKUP(D386,Impactos!$A$2:$C$21,3)","v":"Regulación térmica y disminución de las islas urbanas de calor"},"CMO44",2]
["CMO5","ZONA TRANSPORTE PÚBLICO","MOVILIDAD",4,{"$f":"VLOOKUP(D387,Impactos!$A$2:$C$21,3)","v":"Regulación térmica y disminución de las islas urbanas de calor"},"CMO54",0]
["CMO6","ZONA CARGA SOSTENIBLE","MOVILIDAD",4,{"$f":"VLOOKUP(D388,Impactos!$A$2:$C$21,3)","v":"Regulación térmica y disminución de las islas urbanas de calor"},"CMO64",0]
["CMO7","ZONA VEHÍCULO PRIVADO SOSTENIBLE","MOVILIDAD",4,{"$f":"VLOOKUP(D389,Impactos!$A$2:$C$21,3)","v":"Regulación térmica y disminución de las islas urbanas de calor"},"CMO74",0]
["CMO2","CICLOVIAS","MOVILIDAD",5,{"$f":"VLOOKUP(D390,Impactos!$A$2:$C$21,3)","v":"Mejora de la conectividad ecológica."},"CMO25",0]
["CMO3","CORREDOR PEATONAL ARBOLADO","MOVILIDAD",5,{"$f":"VLOOKUP(D391,Impactos!$A$2:$C$21,3)","v":"Mejora de la conectividad ecológica."},"CMO35",0]
["CMO1","URBANISMO TÁCTICO","MOVILIDAD",5,{"$f":"VLOOKUP(D392,Impactos!$A$2:$C$21,3)","v":"Mejora de la conectividad ecológica."},"CMO15",0]
["CMO4","BANQUETAS","MOVILIDAD",5,{"$f":"VLOOKUP(D393,Impactos!$A$2:$C$21,3)","v":"Mejora de la conectividad ecológica."},"CMO45",3]
["CMO5","ZONA TRANSPORTE PÚBLICO","MOVILIDAD",5,{"$f":"VLOOKUP(D394,Impactos!$A$2:$C$21,3)","v":"Mejora de la conectividad ecológica."},"CMO55",0]
["CMO6","ZONA CARGA SOSTENIBLE","MOVILIDAD",5,{"$f":"VLOOKUP(D395,Impactos!$A$2:$C$21,3)","v":"Mejora de la conectividad ecológica."},"CMO65",0]
["CMO7","ZONA VEHÍCULO PRIVADO SOSTENIBLE","MOVILIDAD",5,{"$f":"VLOOKUP(D396,Impactos!$A$2:$C$21,3)","v":"Mejora de la conectividad ecológica."},"CMO75",0]
["CMO2","CICLOVIAS","MOVILIDAD",6,{"$f":"VLOOKUP(D397,Impactos!$A$2:$C$21,3)","v":"Secuestro de carbono "},"CMO26",2]
["CMO3","CORREDOR PEATONAL ARBOLADO","MOVILIDAD",6,{"$f":"VLOOKUP(D398,Impactos!$A$2:$C$21,3)","v":"Secuestro de carbono "},"CMO36",0]
["CMO1","URBANISMO TÁCTICO","MOVILIDAD",6,{"$f":"VLOOKUP(D399,Impactos!$A$2:$C$21,3)","v":"Secuestro de carbono "},{"$f":"CONCATENATE(A399,D399)","v":"CMO16"},0]
["CMO4","BANQUETAS","MOVILIDAD",6,{"$f":"VLOOKUP(D400,Impactos!$A$2:$C$21,3)","v":"Secuestro de carbono "},"CMO46",3]
["CMO5","ZONA TRANSPORTE PÚBLICO","MOVILIDAD",6,{"$f":"VLOOKUP(D401,Impactos!$A$2:$C$21,3)","v":"Secuestro de carbono "},"CMO56",0]
["CMO6","ZONA CARGA SOSTENIBLE","MOVILIDAD",6,{"$f":"VLOOKUP(D402,Impactos!$A$2:$C$21,3)","v":"Secuestro de carbono "},"CMO66",0]
["CMO7","ZONA VEHÍCULO PRIVADO SOSTENIBLE","MOVILIDAD",6,{"$f":"VLOOKUP(D403,Impactos!$A$2:$C$21,3)","v":"Secuestro de carbono "},"CMO76",0]
["CMO2","CICLOVIAS","MOVILIDAD",7,{"$f":"VLOOKUP(D404,Impactos!$A$2:$C$21,3)","v":"Reducción de emisiones de GEI"},"CMO27",3,3,null,"¿Disuade el uso del automóvil?"]
["CMO3","CORREDOR PEATONAL ARBOLADO","MOVILIDAD",7,{"$f":"VLOOKUP(D405,Impactos!$A$2:$C$21,3)","v":"Reducción de emisiones de GEI"},"CMO37",3]
["CMO1","URBANISMO TÁCTICO","MOVILIDAD",7,{"$f":"VLOOKUP(D406,Impactos!$A$2:$C$21,3)","v":"Reducción de emisiones de GEI"},"CMO17",0,null,null,"Induce la movilidad activa\n\nMejora de iluminación tiene eficiencia energética, si incluye renovables ir a luminarias sustentable\n"]
["CMO4","BANQUETAS","MOVILIDAD",7,{"$f":"VLOOKUP(D407,Impactos!$A$2:$C$21,3)","v":"Reducción de emisiones de GEI"},"CMO47",2]
["CMO5","ZONA TRANSPORTE PÚBLICO","MOVILIDAD",7,{"$f":"VLOOKUP(D408,Impactos!$A$2:$C$21,3)","v":"Reducción de emisiones de GEI"},"CMO57",2]
["CMO6","ZONA CARGA SOSTENIBLE","MOVILIDAD",7,{"$f":"VLOOKUP(D409,Impactos!$A$2:$C$21,3)","v":"Reducción de emisiones de GEI"},"CMO67",2]
["CMO7","ZONA VEHÍCULO PRIVADO SOSTENIBLE","MOVILIDAD",7,{"$f":"VLOOKUP(D410,Impactos!$A$2:$C$21,3)","v":"Reducción de emisiones de GEI"},"CMO77",3]
["CMO2","CICLOVIAS","MOVILIDAD",8,{"$f":"VLOOKUP(D411,Impactos!$A$2:$C$21,3)","v":"Mejora de la calidad del aire"},"CMO28",2,2,null,"¿Disuade el uso del automóvil?"]
["CMO3","CORREDOR PEATONAL ARBOLADO","MOVILIDAD",8,{"$f":"VLOOKUP(D412,Impactos!$A$2:$C$21,3)","v":"Mejora de la calidad del aire"},"CMO38",2]
["CMO1","URBANISMO TÁCTICO","MOVILIDAD",8,{"$f":"VLOOKUP(D413,Impactos!$A$2:$C$21,3)","v":"Mejora de la calidad del aire"},"CMO18",0]
["CMO4","BANQUETAS","MOVILIDAD",8,{"$f":"VLOOKUP(D414,Impactos!$A$2:$C$21,3)","v":"Mejora de la calidad del aire"},"CMO48",0]
["CMO5","ZONA TRANSPORTE PÚBLICO","MOVILIDAD",8,{"$f":"VLOOKUP(D415,Impactos!$A$2:$C$21,3)","v":"Mejora de la calidad del aire"},"CMO58",1]
["CMO6","ZONA CARGA SOSTENIBLE","MOVILIDAD",8,{"$f":"VLOOKUP(D416,Impactos!$A$2:$C$21,3)","v":"Mejora de la calidad del aire"},"CMO68",1]
["CMO7","ZONA VEHÍCULO PRIVADO SOSTENIBLE","MOVILIDAD",8,{"$f":"VLOOKUP(D417,Impactos!$A$2:$C$21,3)","v":"Mejora de la calidad del aire"},"CMO78",3]
["CMO2","CICLOVIAS","MOVILIDAD",9,{"$f":"VLOOKUP(D418,Impactos!$A$2:$C$21,3)","v":"Mejora de la calidad del agua (purificación del agua)"},"CMO29",0]
["CMO3","CORREDOR PEATONAL ARBOLADO","MOVILIDAD",9,{"$f":"VLOOKUP(D419,Impactos!$A$2:$C$21,3)","v":"Mejora de la calidad del agua (purificación del agua)"},"CMO39",0]
["CMO1","URBANISMO TÁCTICO","MOVILIDAD",9,{"$f":"VLOOKUP(D420,Impactos!$A$2:$C$21,3)","v":"Mejora de la calidad del agua (purificación del agua)"},"CMO19",0]
["CMO4","BANQUETAS","MOVILIDAD",9,{"$f":"VLOOKUP(D421,Impactos!$A$2:$C$21,3)","v":"Mejora de la calidad del agua (purificación del agua)"},"CMO49",0]
["CMO5","ZONA TRANSPORTE PÚBLICO","MOVILIDAD",9,{"$f":"VLOOKUP(D422,Impactos!$A$2:$C$21,3)","v":"Mejora de la calidad del agua (purificación del agua)"},"CMO59",0]
["CMO6","ZONA CARGA SOSTENIBLE","MOVILIDAD",9,{"$f":"VLOOKUP(D423,Impactos!$A$2:$C$21,3)","v":"Mejora de la calidad del agua (purificación del agua)"},"CMO69",0]
["CMO7","ZONA VEHÍCULO PRIVADO SOSTENIBLE","MOVILIDAD",9,{"$f":"VLOOKUP(D424,Impactos!$A$2:$C$21,3)","v":"Mejora de la calidad del agua (purificación del agua)"},"CMO79",0]
["CMO2","CICLOVIAS","MOVILIDAD",10,{"$f":"VLOOKUP(D425,Impactos!$A$2:$C$21,3)","v":"Reducción de la contaminación por ruido"},"CMO210",3,3,null,"¿Disuade el uso del automóvil?"]
["CMO3","CORREDOR PEATONAL ARBOLADO","MOVILIDAD",10,{"$f":"VLOOKUP(D426,Impactos!$A$2:$C$21,3)","v":"Reducción de la contaminación por ruido"},"CMO310",3]
["CMO1","URBANISMO TÁCTICO","MOVILIDAD",10,{"$f":"VLOOKUP(D427,Impactos!$A$2:$C$21,3)","v":"Reducción de la contaminación por ruido"},"CMO110",1]
["CMO4","BANQUETAS","MOVILIDAD",10,{"$f":"VLOOKUP(D428,Impactos!$A$2:$C$21,3)","v":"Reducción de la contaminación por ruido"},"CMO410",1]
["CMO5","ZONA TRANSPORTE PÚBLICO","MOVILIDAD",10,{"$f":"VLOOKUP(D429,Impactos!$A$2:$C$21,3)","v":"Reducción de la contaminación por ruido"},"CMO510",0]
["CMO6","ZONA CARGA SOSTENIBLE","MOVILIDAD",10,{"$f":"VLOOKUP(D430,Impactos!$A$2:$C$21,3)","v":"Reducción de la contaminación por ruido"},"CMO610",0]
["CMO7","ZONA VEHÍCULO PRIVADO SOSTENIBLE","MOVILIDAD",10,{"$f":"VLOOKUP(D431,Impactos!$A$2:$C$21,3)","v":"Reducción de la contaminación por ruido"},"CMO710",0]
["CMO2","CICLOVIAS","MOVILIDAD",11,{"$f":"VLOOKUP(D432,Impactos!$A$2:$C$21,3)","v":"Control de la erosión del suelo"},"CMO211",0]
["CMO3","CORREDOR PEATONAL ARBOLADO","MOVILIDAD",11,{"$f":"VLOOKUP(D433,Impactos!$A$2:$C$21,3)","v":"Control de la erosión del suelo"},"CMO311",0]
["CMO1","URBANISMO TÁCTICO","MOVILIDAD",11,{"$f":"VLOOKUP(D434,Impactos!$A$2:$C$21,3)","v":"Control de la erosión del suelo"},"CMO111",0]
["CMO4","BANQUETAS","MOVILIDAD",11,{"$f":"VLOOKUP(D435,Impactos!$A$2:$C$21,3)","v":"Control de la erosión del suelo"},"CMO411",0]
["CMO5","ZONA TRANSPORTE PÚBLICO","MOVILIDAD",11,{"$f":"VLOOKUP(D436,Impactos!$A$2:$C$21,3)","v":"Control de la erosión del suelo"},"CMO511",0]
["CMO6","ZONA CARGA SOSTENIBLE","MOVILIDAD",11,{"$f":"VLOOKUP(D437,Impactos!$A$2:$C$21,3)","v":"Control de la erosión del suelo"},"CMO611",0]
["CMO7","ZONA VEHÍCULO PRIVADO SOSTENIBLE","MOVILIDAD",11,{"$f":"VLOOKUP(D438,Impactos!$A$2:$C$21,3)","v":"Control de la erosión del suelo"},"CMO711",0]
["CMO2","CICLOVIAS","MOVILIDAD",12,{"$f":"VLOOKUP(D439,Impactos!$A$2:$C$21,3)","v":"Mantenimiento, protección y mejora de hábitats, vida silvestre y biodiversidad"},"CMO212",1]
["CMO3","CORREDOR PEATONAL ARBOLADO","MOVILIDAD",12,{"$f":"VLOOKUP(D440,Impactos!$A$2:$C$21,3)","v":"Mantenimiento, protección y mejora de hábitats, vida silvestre y biodiversidad"},"CMO312",0]
["CMO1","URBANISMO TÁCTICO","MOVILIDAD",12,{"$f":"VLOOKUP(D441,Impactos!$A$2:$C$21,3)","v":"Mantenimiento, protección y mejora de hábitats, vida silvestre y biodiversidad"},"CMO112",1]
["CMO4","BANQUETAS","MOVILIDAD",12,{"$f":"VLOOKUP(D442,Impactos!$A$2:$C$21,3)","v":"Mantenimiento, protección y mejora de hábitats, vida silvestre y biodiversidad"},"CMO412",2]
["CMO5","ZONA TRANSPORTE PÚBLICO","MOVILIDAD",12,{"$f":"VLOOKUP(D443,Impactos!$A$2:$C$21,3)","v":"Mantenimiento, protección y mejora de hábitats, vida silvestre y biodiversidad"},"CMO512",0]
["CMO6","ZONA CARGA SOSTENIBLE","MOVILIDAD",12,{"$f":"VLOOKUP(D444,Impactos!$A$2:$C$21,3)","v":"Mantenimiento, protección y mejora de hábitats, vida silvestre y biodiversidad"},"CMO612",0]
["CMO7","ZONA VEHÍCULO PRIVADO SOSTENIBLE","MOVILIDAD",12,{"$f":"VLOOKUP(D445,Impactos!$A$2:$C$21,3)","v":"Mantenimiento, protección y mejora de hábitats, vida silvestre y biodiversidad"},"CMO712",0]
["CMO2","CICLOVIAS","MOVILIDAD",13,{"$f":"VLOOKUP(D446,Impactos!$A$2:$C$21,3)","v":"Producción de servicios ecosistémicos"},"CMO213",1]
["CMO3","CORREDOR PEATONAL ARBOLADO","MOVILIDAD",13,{"$f":"VLOOKUP(D447,Impactos!$A$2:$C$21,3)","v":"Producción de servicios ecosistémicos"},"CMO313",0]
["CMO1","URBANISMO TÁCTICO","MOVILIDAD",13,{"$f":"VLOOKUP(D448,Impactos!$A$2:$C$21,3)","v":"Producción de servicios ecosistémicos"},"CMO113",0]
["CMO4","BANQUETAS","MOVILIDAD",13,{"$f":"VLOOKUP(D449,Impactos!$A$2:$C$21,3)","v":"Producción de servicios ecosistémicos"},"CMO413",2]
["CMO5","ZONA TRANSPORTE PÚBLICO","MOVILIDAD",13,{"$f":"VLOOKUP(D450,Impactos!$A$2:$C$21,3)","v":"Producción de servicios ecosistémicos"},"CMO513",0]
["CMO6","ZONA CARGA SOSTENIBLE","MOVILIDAD",13,{"$f":"VLOOKUP(D451,Impactos!$A$2:$C$21,3)","v":"Producción de servicios ecosistémicos"},"CMO613",0]
["CMO7","ZONA VEHÍCULO PRIVADO SOSTENIBLE","MOVILIDAD",13,{"$f":"VLOOKUP(D452,Impactos!$A$2:$C$21,3)","v":"Producción de servicios ecosistémicos"},"CMO713",0]
["CMO2","CICLOVIAS","MOVILIDAD",14,{"$f":"VLOOKUP(D453,Impactos!$A$2:$C$21,3)","v":"Mejora de los valores estéticos"},"CMO214",2]
["CMO3","CORREDOR PEATONAL ARBOLADO","MOVILIDAD",14,{"$f":"VLOOKUP(D454,Impactos!$A$2:$C$21,3)","v":"Mejora de los valores estéticos"},"CMO314",0]
["CMO1","URBANISMO TÁCTICO","MOVILIDAD",14,{"$f":"VLOOKUP(D455,Impactos!$A$2:$C$21,3)","v":"Mejora de los valores estéticos"},"CMO114",3]
["CMO4","BANQUETAS","MOVILIDAD",14,{"$f":"VLOOKUP(D456,Impactos!$A$2:$C$21,3)","v":"Mejora de los valores estéticos"},"CMO414",1]
["CMO5","ZONA TRANSPORTE PÚBLICO","MOVILIDAD",14,{"$f":"VLOOKUP(D457,Impactos!$A$2:$C$21,3)","v":"Mejora de los valores estéticos"},"CMO514",1]
["CMO6","ZONA CARGA SOSTENIBLE","MOVILIDAD",14,{"$f":"VLOOKUP(D458,Impactos!$A$2:$C$21,3)","v":"Mejora de los valores estéticos"},"CMO614",1]
["CMO7","ZONA VEHÍCULO PRIVADO SOSTENIBLE","MOVILIDAD",14,{"$f":"VLOOKUP(D459,Impactos!$A$2:$C$21,3)","v":"Mejora de los valores estéticos"},"CMO714",0]
["CMO2","CICLOVIAS","MOVILIDAD",15,{"$f":"VLOOKUP(D460,Impactos!$A$2:$C$21,3)","v":"Mejora accesibilidad de recursos para deporte, cultura, formación y recreación"},"CMO215",3,null,"Aumenta la distancia recorrida, el tiempo andando en bicicleta y el tiempo por no pasar tiempo en tráfico "]
["CMO3","CORREDOR PEATONAL ARBOLADO","MOVILIDAD",15,{"$f":"VLOOKUP(D461,Impactos!$A$2:$C$21,3)","v":"Mejora accesibilidad de recursos para deporte, cultura, formación y recreación"},"CMO315",3]
["CMO1","URBANISMO TÁCTICO","MOVILIDAD",15,{"$f":"VLOOKUP(D462,Impactos!$A$2:$C$21,3)","v":"Mejora accesibilidad de recursos para deporte, cultura, formación y recreación"},"CMO115",0,null,null,"Si a todos menos mobiliario"]
["CMO4","BANQUETAS","MOVILIDAD",15,{"$f":"VLOOKUP(D463,Impactos!$A$2:$C$21,3)","v":"Mejora accesibilidad de recursos para deporte, cultura, formación y recreación"},{"$f":"CONCATENATE(A463,D463)","v":"CMO415"},0]
["CMO5","ZONA TRANSPORTE PÚBLICO","MOVILIDAD",15,{"$f":"VLOOKUP(D464,Impactos!$A$2:$C$21,3)","v":"Mejora accesibilidad de recursos para deporte, cultura, formación y recreación"},"CMO515",0]
["CMO6","ZONA CARGA SOSTENIBLE","MOVILIDAD",15,{"$f":"VLOOKUP(D465,Impactos!$A$2:$C$21,3)","v":"Mejora accesibilidad de recursos para deporte, cultura, formación y recreación"},"CMO615",0]
["CMO7","ZONA VEHÍCULO PRIVADO SOSTENIBLE","MOVILIDAD",15,{"$f":"VLOOKUP(D466,Impactos!$A$2:$C$21,3)","v":"Mejora accesibilidad de recursos para deporte, cultura, formación y recreación"},"CMO715",0]
["CMO2","CICLOVIAS","MOVILIDAD",16,{"$f":"VLOOKUP(D467,Impactos!$A$2:$C$21,3)","v":"Mejora de la salud y bienestar"},"CMO216",2]
["CMO3","CORREDOR PEATONAL ARBOLADO","MOVILIDAD",16,{"$f":"VLOOKUP(D468,Impactos!$A$2:$C$21,3)","v":"Mejora de la salud y bienestar"},"CMO316",0]
["CMO1","URBANISMO TÁCTICO","MOVILIDAD",16,{"$f":"VLOOKUP(D469,Impactos!$A$2:$C$21,3)","v":"Mejora de la salud y bienestar"},"CMO116",2]
["CMO4","BANQUETAS","MOVILIDAD",16,{"$f":"VLOOKUP(D470,Impactos!$A$2:$C$21,3)","v":"Mejora de la salud y bienestar"},"CMO416",0]
["CMO5","ZONA TRANSPORTE PÚBLICO","MOVILIDAD",16,{"$f":"VLOOKUP(D471,Impactos!$A$2:$C$21,3)","v":"Mejora de la salud y bienestar"},"CMO516",0]
["CMO6","ZONA CARGA SOSTENIBLE","MOVILIDAD",16,{"$f":"VLOOKUP(D472,Impactos!$A$2:$C$21,3)","v":"Mejora de la salud y bienestar"},"CMO616",0]
["CMO7","ZONA VEHÍCULO PRIVADO SOSTENIBLE","MOVILIDAD",16,{"$f":"VLOOKUP(D473,Impactos!$A$2:$C$21,3)","v":"Mejora de la salud y bienestar"},"CMO716",0]
["CMO2","CICLOVIAS","MOVILIDAD",17,{"$f":"VLOOKUP(D474,Impactos!$A$2:$C$21,3)","v":"Generación de recursos comunitarios (fortalecimiento de la ciudadanía)"},"CMO217",3]
["CMO3","CORREDOR PEATONAL ARBOLADO","MOVILIDAD",17,{"$f":"VLOOKUP(D475,Impactos!$A$2:$C$21,3)","v":"Generación de recursos comunitarios (fortalecimiento de la ciudadanía)"},"CMO317",3]
["CMO1","URBANISMO TÁCTICO","MOVILIDAD",17,{"$f":"VLOOKUP(D476,Impactos!$A$2:$C$21,3)","v":"Generación de recursos comunitarios (fortalecimiento de la ciudadanía)"},"CMO117",3]
["CMO4","BANQUETAS","MOVILIDAD",17,{"$f":"VLOOKUP(D477,Impactos!$A$2:$C$21,3)","v":"Generación de recursos comunitarios (fortalecimiento de la ciudadanía)"},"CMO417",1]
["CMO5","ZONA TRANSPORTE PÚBLICO","MOVILIDAD",17,{"$f":"VLOOKUP(D478,Impactos!$A$2:$C$21,3)","v":"Generación de recursos comunitarios (fortalecimiento de la ciudadanía)"},"CMO517",0]
["CMO6","ZONA CARGA SOSTENIBLE","MOVILIDAD",17,{"$f":"VLOOKUP(D479,Impactos!$A$2:$C$21,3)","v":"Generación de recursos comunitarios (fortalecimiento de la ciudadanía)"},"CMO617",0]
["CMO7","ZONA VEHÍCULO PRIVADO SOSTENIBLE","MOVILIDAD",17,{"$f":"VLOOKUP(D480,Impactos!$A$2:$C$21,3)","v":"Generación de recursos comunitarios (fortalecimiento de la ciudadanía)"},"CMO717",0]
["CMO2","CICLOVIAS","MOVILIDAD",18,{"$f":"VLOOKUP(D481,Impactos!$A$2:$C$21,3)","v":"Fortalecimiento de sentimiento de pertenencia e identidad"},"CMO218",2]
["CMO3","CORREDOR PEATONAL ARBOLADO","MOVILIDAD",18,{"$f":"VLOOKUP(D482,Impactos!$A$2:$C$21,3)","v":"Fortalecimiento de sentimiento de pertenencia e identidad"},"CMO318",3]
["CMO1","URBANISMO TÁCTICO","MOVILIDAD",18,{"$f":"VLOOKUP(D483,Impactos!$A$2:$C$21,3)","v":"Fortalecimiento de sentimiento de pertenencia e identidad"},"CMO118",3]
["CMO4","BANQUETAS","MOVILIDAD",18,{"$f":"VLOOKUP(D484,Impactos!$A$2:$C$21,3)","v":"Fortalecimiento de sentimiento de pertenencia e identidad"},"CMO418",2]
["CMO5","ZONA TRANSPORTE PÚBLICO","MOVILIDAD",18,{"$f":"VLOOKUP(D485,Impactos!$A$2:$C$21,3)","v":"Fortalecimiento de sentimiento de pertenencia e identidad"},"CMO518",0]
["CMO6","ZONA CARGA SOSTENIBLE","MOVILIDAD",18,{"$f":"VLOOKUP(D486,Impactos!$A$2:$C$21,3)","v":"Fortalecimiento de sentimiento de pertenencia e identidad"},"CMO618",0]
["CMO7","ZONA VEHÍCULO PRIVADO SOSTENIBLE","MOVILIDAD",18,{"$f":"VLOOKUP(D487,Impactos!$A$2:$C$21,3)","v":"Fortalecimiento de sentimiento de pertenencia e identidad"},"CMO718",0]
["CMO2","CICLOVIAS","MOVILIDAD",19,{"$f":"VLOOKUP(D488,Impactos!$A$2:$C$21,3)","v":"Optimización de la inversión pública "},"CMO219",2]
["CMO3","CORREDOR PEATONAL ARBOLADO","MOVILIDAD",19,{"$f":"VLOOKUP(D489,Impactos!$A$2:$C$21,3)","v":"Optimización de la inversión pública "},"CMO319",0]
["CMO1","URBANISMO TÁCTICO","MOVILIDAD",19,{"$f":"VLOOKUP(D490,Impactos!$A$2:$C$21,3)","v":"Optimización de la inversión pública "},"CMO119",0]
["CMO4","BANQUETAS","MOVILIDAD",19,{"$f":"VLOOKUP(D491,Impactos!$A$2:$C$21,3)","v":"Optimización de la inversión pública "},"CMO419",2]
["CMO5","ZONA TRANSPORTE PÚBLICO","MOVILIDAD",19,{"$f":"VLOOKUP(D492,Impactos!$A$2:$C$21,3)","v":"Optimización de la inversión pública "},"CMO519",0]
["CMO6","ZONA CARGA SOSTENIBLE","MOVILIDAD",19,{"$f":"VLOOKUP(D493,Impactos!$A$2:$C$21,3)","v":"Optimización de la inversión pública "},"CMO619",0]
["CMO7","ZONA VEHÍCULO PRIVADO SOSTENIBLE","MOVILIDAD",19,{"$f":"VLOOKUP(D494,Impactos!$A$2:$C$21,3)","v":"Optimización de la inversión pública "},"CMO719",1]
["CMO2","CICLOVIAS","MOVILIDAD",20,{"$f":"VLOOKUP(D495,Impactos!$A$2:$C$21,3)","v":"Atracción para negocios, turismo y economía verde"},"CMO220",2,2,"Aumenta el tiempo invertido en áreas de tiendas.","¿Hay tiendas y negocios alrededor?"]
["CMO3","CORREDOR PEATONAL ARBOLADO","MOVILIDAD",20,{"$f":"VLOOKUP(D496,Impactos!$A$2:$C$21,3)","v":"Atracción para negocios, turismo y economía verde"},"CMO320",3]
["CMO1","URBANISMO TÁCTICO","MOVILIDAD",20,{"$f":"VLOOKUP(D497,Impactos!$A$2:$C$21,3)","v":"Atracción para negocios, turismo y economía verde"},"CMO120",2]
["CMO4","BANQUETAS","MOVILIDAD",20,{"$f":"VLOOKUP(D498,Impactos!$A$2:$C$21,3)","v":"Atracción para negocios, turismo y economía verde"},"CMO420",3]
["CMO5","ZONA TRANSPORTE PÚBLICO","MOVILIDAD",20,{"$f":"VLOOKUP(D499,Impactos!$A$2:$C$21,3)","v":"Atracción para negocios, turismo y economía verde"},"CMO520",0]
["CMO6","ZONA CARGA SOSTENIBLE","MOVILIDAD",20,{"$f":"VLOOKUP(D500,Impactos!$A$2:$C$21,3)","v":"Atracción para negocios, turismo y economía verde"},"CMO620",1]
["CMO7","ZONA VEHÍCULO PRIVADO SOSTENIBLE","MOVILIDAD",20,{"$f":"VLOOKUP(D501,Impactos!$A$2:$C$21,3)","v":"Atracción para negocios, turismo y economía verde"},"CMO720",2]
["CA8"," JARDINERAS FILTRANTES","AGUA",1,{"$f":"VLOOKUP('Impactos Data'!D502,Impactos!$A$2:$C$21,3)","v":"Prevención de inundaciones, regulación de escorrentías"},"CA81",3]
["CA8"," JARDINERAS FILTRANTES","AGUA",2,{"$f":"VLOOKUP('Impactos Data'!D503,Impactos!$A$2:$C$21,3)","v":"Reducción de los riesgos derivados de las inundaciones, regulación de avenidas."},"CA82",2]
["CA8"," JARDINERAS FILTRANTES","AGUA",3,{"$f":"VLOOKUP('Impactos Data'!D504,Impactos!$A$2:$C$21,3)","v":"Incremento de la recarga de agua de los acuíferos"},"CA83",3]
["CA8"," JARDINERAS FILTRANTES","AGUA",4,{"$f":"VLOOKUP('Impactos Data'!D505,Impactos!$A$2:$C$21,3)","v":"Regulación térmica y disminución de las islas urbanas de calor"},"CA84",2]
["CA8"," JARDINERAS FILTRANTES","AGUA",5,{"$f":"VLOOKUP('Impactos Data'!D506,Impactos!$A$2:$C$21,3)","v":"Mejora de la conectividad ecológica."},"CA85",2]
["CA8"," JARDINERAS FILTRANTES","AGUA",6,{"$f":"VLOOKUP('Impactos Data'!D507,Impactos!$A$2:$C$21,3)","v":"Secuestro de carbono "},"CA86",1]
["CA8"," JARDINERAS FILTRANTES","AGUA",7,{"$f":"VLOOKUP('Impactos Data'!D508,Impactos!$A$2:$C$21,3)","v":"Reducción de emisiones de GEI"},"CA87",0]
["CA8"," JARDINERAS FILTRANTES","AGUA",8,{"$f":"VLOOKUP('Impactos Data'!D509,Impactos!$A$2:$C$21,3)","v":"Mejora de la calidad del aire"},"CA88",0]
["CA8"," JARDINERAS FILTRANTES","AGUA",9,{"$f":"VLOOKUP('Impactos Data'!D510,Impactos!$A$2:$C$21,3)","v":"Mejora de la calidad del agua (purificación del agua)"},"CA89",3]
["CA8"," JARDINERAS FILTRANTES","AGUA",10,{"$f":"VLOOKUP('Impactos Data'!D511,Impactos!$A$2:$C$21,3)","v":"Reducción de la contaminación por ruido"},"CA810",0]
["CA8"," JARDINERAS FILTRANTES","AGUA",11,{"$f":"VLOOKUP('Impactos Data'!D512,Impactos!$A$2:$C$21,3)","v":"Control de la erosión del suelo"},"CA811",2]
["CA8"," JARDINERAS FILTRANTES","AGUA",12,{"$f":"VLOOKUP('Impactos Data'!D513,Impactos!$A$2:$C$21,3)","v":"Mantenimiento, protección y mejora de hábitats, vida silvestre y biodiversidad"},"CA812",2]
["CA8"," JARDINERAS FILTRANTES","AGUA",13,{"$f":"VLOOKUP('Impactos Data'!D514,Impactos!$A$2:$C$21,3)","v":"Producción de servicios ecosistémicos"},"CA813",2]
["CA8"," JARDINERAS FILTRANTES","AGUA",14,{"$f":"VLOOKUP('Impactos Data'!D515,Impactos!$A$2:$C$21,3)","v":"Mejora de los valores estéticos"},"CA814",3]
["CA8"," JARDINERAS FILTRANTES","AGUA",15,{"$f":"VLOOKUP('Impactos Data'!D516,Impactos!$A$2:$C$21,3)","v":"Mejora accesibilidad de recursos para deporte, cultura, formación y recreación"},"CA815",0]
["CA8"," JARDINERAS FILTRANTES","AGUA",16,{"$f":"VLOOKUP('Impactos Data'!D517,Impactos!$A$2:$C$21,3)","v":"Mejora de la salud y bienestar"},"CA816",0]
["CA8"," JARDINERAS FILTRANTES","AGUA",17,{"$f":"VLOOKUP('Impactos Data'!D518,Impactos!$A$2:$C$21,3)","v":"Generación de recursos comunitarios (fortalecimiento de la ciudadanía)"},"CA817",0]
["CA8"," JARDINERAS FILTRANTES","AGUA",18,{"$f":"VLOOKUP('Impactos Data'!D519,Impactos!$A$2:$C$21,3)","v":"Fortalecimiento de sentimiento de pertenencia e identidad"},"CA818",0]
["CA8"," JARDINERAS FILTRANTES","AGUA",19,{"$f":"VLOOKUP('Impactos Data'!D520,Impactos!$A$2:$C$21,3)","v":"Optimización de la inversión pública "},"CA819",0]
["CA8"," JARDINERAS FILTRANTES","AGUA",20,{"$f":"VLOOKUP('Impactos Data'!D521,Impactos!$A$2:$C$21,3)","v":"Atracción para negocios, turismo y economía verde"},"CA820",0]

{"sheet":"2b Componentes Biodiversidad","index":13,"n_rows":183,"n_cols":22,"rows_kept":183,"cut":false,"hidden":true,"merged":[[8,1,10,12],[13,1,13,15],[22,1,24,12],[23,14,23,16],[25,14,27,18],[25,19,27,21],[26,2,55,12],[26,13,40,13],[28,14,29,15],[46,14,47,20],[46,21,47,21],[49,14,50,20],[49,21,50,21],[52,14,54,20],[52,21,53,21],[23,17,23,19],[43,14,44,17],[99,3,100,12],[84,17,84,19],[56,2,57,2],[56,3,57,12],[56,14,57,20],[56,21,57,21],[60,1,62,12],[61,14,61,16],[28,17,29,17],[28,19,29,21],[31,14,32,15],[31,17,32,17],[31,19,32,21],[34,14,35,15],[34,17,35,17],[34,19,35,21],[61,17,61,19],[37,14,38,15],[37,17,38,17],[37,19,38,21],[40,14,41,15],[40,17,41,17],[40,19,41,21],[43,19,44,21],[87,14,88,20],[93,14,94,20],[119,21,120,21],[103,1,105,12],[104,14,104,16],[76,21,77,21],[79,2,80,2],[79,3,80,12],[79,14,80,20],[79,21,80,21],[83,1,85,12],[84,14,84,16],[64,2,78,12],[64,14,65,20],[64,21,65,21],[67,14,68,20],[67,21,68,21],[70,14,71,20],[70,21,71,21],[73,14,74,20],[73,21,74,21],[76,14,77,20],[87,2,98,12],[99,2,100,2],[113,21,114,21],[116,14,117,20],[116,21,117,21],[119,14,120,20],[179,14,180,20],[179,21,180,21],[181,2,185,2],[181,3,184,12],[182,14,183,20],[182,21,183,21],[160,2,180,12],[160,14,161,20],[160,21,161,21],[163,14,164,20],[163,21,164,21],[166,14,167,20],[166,21,167,21],[169,14,170,20],[169,21,170,21],[172,14,173,20],[172,21,173,21],[175,14,177,20],[175,21,176,21],[156,1,158,12],[129,1,131,12],[133,2,151,12],[136,14,137,20],[136,21,137,21],[139,14,140,20],[139,21,140,21],[157,14,157,16],[142,14,144,20],[142,21,143,21],[146,14,147,20],[146,21,147,21],[149,14,150,20],[149,21,150,21],[130,14,130,16],[133,14,134,20],[133,21,134,21],[130,17,130,19],[157,17,157,19],[152,14,153,20],[152,21,153,21],[1,1,1,23],[125,2,126,2],[125,3,127,12],[125,14,126,20],[125,21,126,21],[107,2,124,12],[107,14,108,20],[152,2,153,2],[152,3,153,12],[122,14,123,20],[122,21,123,21],[87,21,88,21],[90,14,91,20],[90,21,91,21],[93,21,94,21],[96,14,97,20],[99,14,100,20],[96,21,97,21],[99,21,100,21],[104,17,104,19],[107,21,108,21],[110,14,111,20],[110,21,111,21],[113,14,114,20]]}
[]
[null,"Herramienta para la estimación y evaluación de los impactos de la infraestructura verde"]
[]
[null,null,null,null,null,"1. Introducción ",null,null,null,"2. Preparar evaluación ",null,null,null,null,"3. Recolección de datos",null,null,null,null,"4. Impactos/Resultados"]
[]
[null,null,null,null,null,null,"2a. Componentes AGUA",null,null,null,"2b. Componentes BIODIVERSIDAD",null,null,null,null,"2c. Componentes MOVILIDAD",null,null,null,null,"2d. Componentes ESPACIO PUBLICO"]
[]
[null,"Acerca de esta pestaña:"]
[null,"Esta pestaña tiene la definición de los componentes de IV del eje de Biodiversidad"]
[]
[]
[]
[]
[null,"2b. Selección de componentes de IV del eje BIODIVERSIDAD"]
[]
[]
[]
[]
[]
[]
[]
[]
[null,{"$f":"\"    \"&Biodiversidad!B3","v":"    ARBOLADO"}]
[null,null,null,null,null,null,null,null,null,null,null,null,null,null,"Presupuesto asignado",null,null,0,null,null,null,{"$f":"Biodiversidad!B2","v":"CB1"}]
[]
[null,null,null,null,null,null,null,null,null,null,null,null,null,null,{"$f":"\"          \"&Biodiversidad!B7","v":"          Número de ejemplares según su porte \n         (altura) prevista en la edad adulta"},null,null,null,null,{"$f":"Biodiversidad!B13","v":"¿Qué especie?"}]
[null,null,{"$f":"Biodiversidad!B4","v":"Se refiere al conjunto de especies vegetales que integran la paleta vegetal de una ciudad y que incluyen árboles (grandes, medianos y chicos), arbustos y subarbustos, herbáceas y plantas; tanto nativos como especies adaptadas al clima y destinadas a espacios públicos como parques, banquetas, camellones, glorietas, bajopuentes, muros o superficies verticales y espacios residuales. "}]
[]
[null,null,null,null,null,null,null,null,null,null,null,null,null,null,{"$f":"\"          \"&Biodiversidad!B8","v":"          < 5m"}]
[]
[]
[null,null,null,null,null,null,null,null,null,null,null,null,null,null,{"$f":"\"          \"&Biodiversidad!B9","v":"          5m < 10m"}]
[]
[]
[null,null,null,null,null,null,null,null,null,null,null,null,null,null,{"$f":"\"          \"&Biodiversidad!B10","v":"          10m < 15m"}]
[]
[]
[null,null,null,null,null,null,null,null,null,null,null,null,null,null,{"$f":"\"          \"&Biodiversidad!B11","v":"          15m < 20m"}]
[]
[]
[null,null,null,null,null,null,null,null,null,null,null,null,null,null,{"$f":"\"          \"&Biodiversidad!B12","v":"          >20m"}]
[]
[]
[null,null,null,null,null,null,null,null,null,null,null,null,null,null,{"$f":"\"          \"&\"No sé su altura\"","v":"          No sé su altura"}]
[]
[]
[null,null,null,null,null,null,null,null,null,null,null,null,null,null,{"$f":"\"          \"&Biodiversidad!B25","v":"          ¿Cuál es la unidad de arbolado por hectárea? \n           (uA/ha)(ID OMS - 1ud/3hab)"}]
[]
[]
[null,null,null,null,null,null,null,null,null,null,null,null,null,null,{"$f":"\"          \"&Biodiversidad!B30","v":"          ¿Las especies elegidas generan sombra y regulan \n           térmicamente el espacio?"}]
[]
[]
[null,null,null,null,null,null,null,null,null,null,null,null,null,null,{"$f":"\"          \"&Biodiversidad!B44","v":"          ¿Las especies elegidas añaden valores aspectos estéticos \n          y generan recursos comunitarios (como alimentos, plantas \n          o elementos florales culturales)?"}]
[]
[]
[]
[null,null,{"$f":"IF(D57=0,\" \",\"Fuente:\")","v":"Fuente:"},{"$f":"Biodiversidad!B5","v":"Terrones Rincón, T.; Vittoria E. Partida Pizzini, Cristina González y Martín Tovar (2014) Plantas silvestres en el paisaje urbano. Municipio de León Guanajuato. Instituto Municipl de Planeación. México. 211p"},null,null,null,null,null,null,null,null,null,null,{"$f":"\"          \"&Biodiversidad!B51","v":"          ¿Las especies optimiza la inversión y carece de regadío \n           y mantenimiento?"}]
[]
[]
[]
[null,{"$f":"\"    \"&Biodiversidad!C3","v":"    BOSQUE URBANO"}]
[null,null,null,null,null,null,null,null,null,null,null,null,null,null,"Presupuesto asignado",null,null,0,null,null,null,{"$f":"Biodiversidad!C2","v":"CB2"}]
[]
[]
[null,null,{"$f":"Biodiversidad!C4","v":"Se refiere una superficie de cuando menos  5 hectárea inmerso en el área urbana (espacio artificializado) destinada a la preservación del entorno natural, la conservación de la biodiversidad urbana y la prestación de servicios ecosistémicos. \n\nPuede tener una mínima introducción de infraestructura para actividades recreativas, deportivas, científicas y culturales. "},null,null,null,null,null,null,null,null,null,null,null,{"$f":"\"          \"&Biodiversidad!C7","v":"          Hectáreas de bosque "}]
[]
[]
[null,null,null,null,null,null,null,null,null,null,null,null,null,null,{"$f":"\"          \"&Biodiversidad!C8","v":"          ¿Cuenta con infraestructura recreativa\n         y/o deportiva que promueva el encuentro?"}]
[]
[]
[null,null,null,null,null,null,null,null,null,null,null,null,null,null,{"$f":"\"          \"&Biodiversidad!C25","v":"          ¿Cuál es la relación del bosque urbano por habitante? \n        (M2av/hab) - (ID OMS 9m2 AV/hab)"}]
[]
[]
[null,null,null,null,null,null,null,null,null,null,null,null,null,null,{"$f":"\"          \"&Biodiversidad!C30","v":"          ¿Qué superficie de suelo permeable contiene como pastos o \n         pastizales que favorecen la infiltración de agua ? "}]
[]
[]
[null,null,null,null,null,null,null,null,null,null,null,null,null,null,{"$f":"\"          \"&Biodiversidad!C37","v":"          ¿Contiene servicios de soporte  (diversidad de especies y \n          sus ecosistemas, humedales, polinizadores, etc.)?"}]
[]
[]
[null,null,{"$f":"IF(D80=0,\" \",\"Fuente:\")","v":"Fuente:"},{"$f":"Biodiversidad!C5","v":"Pérez, María; Cristina R. de León, Luis, Romahn y Álvaro Gómez (2019) Grandes parques y bosques urbanos de México. Investigación para la toma de decisiones. Asociación Nacional de Parques y Recreación de México. México. 35p"},null,null,null,null,null,null,null,null,null,null,{"$f":"\"          \"&Biodiversidad!C51","v":"          ¿Contiene servicios de aprovisionamiento? (Alimentos, \n         recursos naturales, genera empleo)"}]
[]
[]
[]
[null,{"$f":"\"    \" &Biodiversidad!D3","v":"    JARDINES EDUCATIVOS"}]
[null,null,null,null,null,null,null,null,null,null,null,null,null,null,"Presupuesto asignado",null,null,0,null,null,null,{"$f":"Biodiversidad!D2","v":"CB3"}]
[]
[]
[null,null,{"$f":"Biodiversidad!D4","v":"Se refiere a un espacio, aula o conjunto de aulas habilitado al área libre, semicubierto o totalmente cubierto para llevar a cabo actividades educativas, deportivas, culturales y de apropiación de ciencia y tencología; por lo común inmerso en un parque urbano, metropolitano o en un bosque urbano."},null,null,null,null,null,null,null,null,null,null,null,{"$f":"\"          \"&Biodiversidad!D7","v":"          ¿Cuenta con arbolado? "},null,null,null,null,null,null,"SI"]
[]
[]
[null,null,null,null,null,null,null,null,null,null,null,null,null,null,{"$f":"\"          \"&Biodiversidad!D8","v":"          m2 de superficie"}]
[]
[]
[null,null,null,null,null,null,null,null,null,null,null,null,null,null,{"$f":"\"          \"&Biodiversidad!D25","v":"          ¿El espacio reutiliza suelo que se encontraba artificializado \n           o cubierto por concreto, asfalto u otro material? "},null,null,null,null,null,null,"NO"]
[]
[]
[null,null,null,null,null,null,null,null,null,null,null,null,null,null,{"$f":"\"          \"&Biodiversidad!D30","v":"          ¿Está ubicado cerca de un núcleo urbano y/o accesible \n         mediante movilidad activa?"},null,null,null,null,null,null,"SI"]
[]
[]
[null,null,{"$f":"IF(D100=0,\" \",\"Fuente:\")","v":" "},{"$f":"Biodiversidad!D5","v":0},null,null,null,null,null,null,null,null,null,null,{"$f":"\"          \"&Biodiversidad!D44","v":"          ¿Sirve como punto de encuentro vecinal, espacio para \n          talleres sobre educación ambiental u otros temas?"},null,null,null,null,null,null,"NO"]
[]
[]
[]
[null,{"$f":"\"    \"&Biodiversidad!E3","v":"    HUERTOS URBANOS"}]
[null,null,null,null,null,null,null,null,null,null,null,null,null,null,"Presupuesto asignado",null,null,0,null,null,null,{"$f":"Biodiversidad!E2","v":"CB4"}]
[]
[]
[null,null,{"$f":"Biodiversidad!E4","v":"Se refiere a un espacio limitado ubicado dentro de la ciudad donde se siembra una gran diversidad de plantas (medicinales, aromáticas, hortalizas, ornamientales) y árboles frutales cuyo principal objetivo es producir alimentos."},null,null,null,null,null,null,null,null,null,null,null,{"$f":"\"          \"&Biodiversidad!E7","v":"          m2 superficie de huerto "}]
[]
[]
[null,null,null,null,null,null,null,null,null,null,null,null,null,null,{"$f":"\"          \"&Biodiversidad!E8","v":"          kg de alimentos producidos / año (estimado)"}]
[]
[]
[null,null,null,null,null,null,null,null,null,null,null,null,null,null,{"$f":"\"          \"&Biodiversidad!E25","v":"          ¿El espacio reutiliza suelo que se encontraba artificializado \n           o cubierto por concreto, asfalto u otro material? "}]
[]
[]
[null,null,null,null,null,null,null,null,null,null,null,null,null,null,{"$f":"\"          \"&Biodiversidad!E30","v":"          ¿Está ubicado cerca de un núcleo urbano y/o  accesible \n          mediante movilidad activa?"}]
[]
[]
[null,null,null,null,null,null,null,null,null,null,null,null,null,null,{"$f":"\"          \"&Biodiversidad!E37","v":"          ¿Contiene especies nativas y fomenta la agroecología y \n          sostenibilidad del uso de la tierra?"}]
[]
[]
[null,null,null,null,null,null,null,null,null,null,null,null,null,null,{"$f":"\"          \"&Biodiversidad!E44","v":"          ¿Sirven como punto de encuentro vecinal, espacio de \n          reivindicación de ideas y propuestas  ?"}]
[]
[]
[null,null,{"$f":"IF(D126=0,\" \",\"Fuente:\")","v":"Fuente:"},{"$f":"Biodiversidad!E5","v":"SEDEMA (2016) Guía de Huertos Urbanos. Secretaria de Medio Ambiente de la Ciudad de México. México. 47p. Disponible en: http://data.sedema.cdmx.gob.mx/flippingbook/guia-huertos-urbanos/#p=51. Última consulta: 23 de agosto de 2021\nhttps://dialnet.unirioja.es/servlet/articulo?codigo=7596353"},null,null,null,null,null,null,null,null,null,null,{"$f":"\"          \"&Biodiversidad!E51","v":"           ¿Incentiva la suficiencia para el consumo y \n          producción alimentaria?"}]
[]
[]
[]
[null,{"$f":"\"   \"&Biodiversidad!F3","v":"   RENATURALIZACION DE ELEMENTOS FLUVIALES"}]
[null,null,null,null,null,null,null,null,null,null,null,null,null,null,"Presupuesto asignado",null,null,0,null,null,null,{"$f":"Biodiversidad!F2","v":"CB5"}]
[]
[]
[null,null,{"$f":"Biodiversidad!F4","v":"Se refiere a la liberación de las laderas de cauces de ríos y cuerpos de agua superficial que fueron ocupadas por asentamientos humanos e infraestructura urbana con el propósito de que recuperen su capacidad de prestar bienes y servicios ambienales a la ciudad y contribuir a la preservación de los ecosistemas y la biodiversidad en la ciudad."},null,null,null,null,null,null,null,null,null,null,null,{"$f":"\"          \"&Biodiversidad!F7","v":"          Hectáreas de la superficie de laderas recuperada"}]
[]
[]
[null,null,null,null,null,null,null,null,null,null,null,null,null,null,{"$f":"\"          \"&Biodiversidad!F8","v":"          m2 de sección hidráulica de la propuesta "}]
[]
[]
[null,null,null,null,null,null,null,null,null,null,null,null,null,null,{"$f":"\"          \"&Biodiversidad!F25","v":"          ¿La renaturalización se ha hecho de forma natural o sobre \n          infraestructura gris?"}]
[]
[]
[null,null,null,null,null,null,null,null,null,null,null,null,null,null,{"$f":"\"          \"&Biodiversidad!F30","v":"          ¿Está previsto el aumento de absorción de agua y \n          escorrentías para los temporales futuros de variabilidad \n          de precipitaciones?"}]
[]
[]
[]
[null,null,null,null,null,null,null,null,null,null,null,null,null,null,{"$f":"\"          \"&Biodiversidad!F37","v":"          ¿Contiene servicios de soporte? (diversidad de especies \n          y sus ecosistemas, humedales, polinizadores, etc.) "}]
[]
[]
[null,null,null,null,null,null,null,null,null,null,null,null,null,null,{"$f":"\"          \"&Biodiversidad!F44","v":"          ¿Incluye servicios culturales (deportes, ocio, etc)?"}]
[]
[]
[null,null,{"$f":"IF(D153=0,\" \",\"Fuente:\")","v":"Fuente:"},{"$f":"Biodiversidad!F5","v":"https://www.euskadi.eus/contenidos/documentacion/soluciones_naturales/es_def/adjuntos/SOLUCIONESNATURALES.pdf"},null,null,null,null,null,null,null,null,null,null,{"$f":"\"          \"&Biodiversidad!F51","v":"          ¿Incentiva la economía local como resultado del manejo \n          paisajístico urbano?"}]
[]
[]
[]
[null,{"$f":"\"    \"&Biodiversidad!G3","v":"    DESENTUBADO DE RIOS"}]
[null,null,null,null,null,null,null,null,null,null,null,null,null,null,"Presupuesto asignado",null,null,0,null,null,null,{"$f":"Biodiversidad!G2","v":"CB6"}]
[]
[]
[null,null,{"$f":"Biodiversidad!G4","v":"Se refiere a la recuperación de las funciones ecológicas y ambientales de un río que fue entubado en años previos a través del desentubamiento y la recuperación de su cauce y su rehabilitación con elementos tanto naturales (arbolado) como artificiales (reencausamiento, represas, senderos peatonales y ciclistas, parques lineales, jardines, humedales y equipamiento e instalaciones deportivas, culturales y recreativas)."},null,null,null,null,null,null,null,null,null,null,null,{"$f":"\"          \"&Biodiversidad!G7","v":"          Superficie permeable recuperada (m2)"}]
[]
[]
[null,null,null,null,null,null,null,null,null,null,null,null,null,null,{"$f":"\"          \"&Biodiversidad!G8","v":"          Superficie natural recuperada (m2)"}]
[]
[]
[null,null,null,null,null,null,null,null,null,null,null,null,null,null,{"$f":"\"          \"&Biodiversidad!G9","v":"          Número ejemplares arbóreos (árboles, arbustos, plantas)"}]
[]
[]
[null,null,null,null,null,null,null,null,null,null,null,null,null,null,{"$f":"\"          \"&Biodiversidad!G25","v":"          ¿El desentubado se ha hecho de forma natural (permeable)  \n        o sobre infraestructura gris (impermeable)?"}]
[]
[]
[null,null,null,null,null,null,null,null,null,null,null,null,null,null,{"$f":"\"          \"&Biodiversidad!G30","v":"          ¿Está ubicada cerca de un núcleo urbano y conectado con \n          otros? "}]
[]
[]
[null,null,null,null,null,null,null,null,null,null,null,null,null,null,{"$f":"\"          \"&Biodiversidad!G37","v":"          ¿Genera algún tipo de conectividad ecológica (diversidad \n          de especies y sus ecosistemas, humedales, polinizadores, \n          etc.)  "}]
[]
[]
[]
[null,null,null,null,null,null,null,null,null,null,null,null,null,null,{"$f":"\"          \"&Biodiversidad!G44","v":"          ¿Incluye servicios culturales (deportes, ocio, etc)?"}]
[]
[null,null,{"$f":"IF(D182=0,\" \",\"Fuente:\")","v":"Fuente:"},{"$f":"Biodiversidad!G5","v":"https://www.euskadi.eus/contenidos/documentacion/soluciones_naturales/es_def/adjuntos/SOLUCIONESNATURALES.pdf\nhttps://www.teseopress.com/pensarlasinfraestructurasenlatinoamerica/chapter/beneficios-y-desafios-en-la-implementacion-de-2/"}]
[null,null,null,null,null,null,null,null,null,null,null,null,null,null,{"$f":"\"          \"&Biodiversidad!G51","v":"          ¿Incentiva la economía local y aumenta el valor de la \n          propiedad como resultado del manejo paisajístico urbano?"}]

{"sheet":"Biodiversidad","index":14,"n_rows":57,"n_cols":7,"rows_kept":57,"cut":false,"hidden":true,"merged":[]}
["Eje","Biodiversidad","Biodiversidad","Biodiversidad","Biodiversidad","Biodiversidad","Biodiversidad"]
["Código","CB1","CB2","CB3","CB4","CB5","CB6"]
["Componentes","ARBOLADO","BOSQUE URBANO","JARDINES EDUCATIVOS","HUERTOS URBANOS","RENATURALIZACION DE ELEMENTOS FLUVIALES","DESENTUBADO DE RIOS"]
["Descripción","Se refiere al conjunto de especies vegetales que integran la paleta vegetal de una ciudad y que incluyen árboles (grandes, medianos y chicos), arbustos y subarbustos, herbáceas y plantas; tanto nativos como especies adaptadas al clima y destinadas a espacios públicos como parques, banquetas, camellones, glorietas, bajopuentes, muros o superficies verticales y espacios residuales. ","Se refiere una superficie de cuando menos  5 hectárea inmerso en el área urbana (espacio artificializado) destinada a la preservación del entorno natural, la conservación de la biodiversidad urbana y la prestación de servicios ecosistémicos. \n\nPuede tener una mínima introducción de infraestructura para actividades recreativas, deportivas, científicas y culturales. ","Se refiere a un espacio, aula o conjunto de aulas habilitado al área libre, semicubierto o totalmente cubierto para llevar a cabo actividades educativas, deportivas, culturales y de apropiación de ciencia y tencología; por lo común inmerso en un parque urbano, metropolitano o en un bosque urbano.","Se refiere a un espacio limitado ubicado dentro de la ciudad donde se siembra una gran diversidad de plantas (medicinales, aromáticas, hortalizas, ornamientales) y árboles frutales cuyo principal objetivo es producir alimentos.","Se refiere a la liberación de las laderas de cauces de ríos y cuerpos de agua superficial que fueron ocupadas por asentamientos humanos e infraestructura urbana con el propósito de que recuperen su capacidad de prestar bienes y servicios ambienales a la ciudad y contribuir a la preservación de los ecosistemas y la biodiversidad en la ciudad.","Se refiere a la recuperación de las funciones ecológicas y ambientales de un río que fue entubado en años previos a través del desentubamiento y la recuperación de su cauce y su rehabilitación con elementos tanto naturales (arbolado) como artificiales (reencausamiento, represas, senderos peatonales y ciclistas, parques lineales, jardines, humedales y equipamiento e instalaciones deportivas, culturales y recreativas)."]
["Referencia","Terrones Rincón, T.; Vittoria E. Partida Pizzini, Cristina González y Martín Tovar (2014) Plantas silvestres en el paisaje urbano. Municipio de León Guanajuato. Instituto Municipl de Planeación. México. 211p","Pérez, María; Cristina R. de León, Luis, Romahn y Álvaro Gómez (2019) Grandes parques y bosques urbanos de México. Investigación para la toma de decisiones. Asociación Nacional de Parques y Recreación de México. México. 35p",null,"SEDEMA (2016) Guía de Huertos Urbanos. Secretaria de Medio Ambiente de la Ciudad de México. México. 47p. Disponible en: http://data.sedema.cdmx.gob.mx/flippingbook/guia-huertos-urbanos/#p=51. Última consulta: 23 de agosto de 2021\nhttps://dialnet.unirioja.es/servlet/articulo?codigo=7596353","https://www.euskadi.eus/contenidos/documentacion/soluciones_naturales/es_def/adjuntos/SOLUCIONESNATURALES.pdf","https://www.euskadi.eus/contenidos/documentacion/soluciones_naturales/es_def/adjuntos/SOLUCIONESNATURALES.pdf\nhttps://www.teseopress.com/pensarlasinfraestructurasenlatinoamerica/chapter/beneficios-y-desafios-en-la-implementacion-de-2/"]
["Pregunta 1","¿El proyecto incluye un área verde con árboles, pastos, y/o es una superficie permeable (pasto, adopasto, adoquín)?","¿El proyecto es o incluye un bosque urbano?","¿El proyecto es o incluye un jardín o parque educativo?","¿El proyecto es o incluye un huerto urbano?","¿El proyecto es o incluye una renaturalización de elementos fluviales ?","¿El proyecto es o incluye un desentubamiento del rio ?"]
["Pregunta 1SI","Número de ejemplares según su porte \n         (altura) prevista en la edad adulta","Hectáreas de bosque ","¿Cuenta con arbolado? ","m2 superficie de huerto ","Hectáreas de la superficie de laderas recuperada","Superficie permeable recuperada (m2)"]
[null,"< 5m","¿Cuenta con infraestructura recreativa\n         y/o deportiva que promueva el encuentro?","m2 de superficie","kg de alimentos producidos / año (estimado)","m2 de sección hidráulica de la propuesta ","Superficie natural recuperada (m2)"]
[null,"5m < 10m",null,null,null,null,"Número ejemplares arbóreos (árboles, arbustos, plantas)"]
[null,"10m < 15m"]
[null,"15m < 20m"]
[null,">20m"]
[null,"¿Qué especie?"]
[]
[]
[]
[]
[null,"Nativo"]
[null,"No nativo "]
[null,"Ambas "]
[null,"No sé"]
[null,"Número de especies"]
[null,"Número de especies"]
[null,"Número de especies"]
["Pregunta Q1","¿Cuál es la unidad de arbolado por hectárea? \n           (uA/ha)(ID OMS - 1ud/3hab)","¿Cuál es la relación del bosque urbano por habitante? \n        (M2av/hab) - (ID OMS 9m2 AV/hab)","¿El espacio reutiliza suelo que se encontraba artificializado \n           o cubierto por concreto, asfalto u otro material? ","¿El espacio reutiliza suelo que se encontraba artificializado \n           o cubierto por concreto, asfalto u otro material? ","¿La renaturalización se ha hecho de forma natural o sobre \n          infraestructura gris?","¿El desentubado se ha hecho de forma natural (permeable)  \n        o sobre infraestructura gris (impermeable)?"]
["RQ1","0 - 0,003","0 - 9","SI","SI","NATURAL ","NATURAL "]
["RQ2","  > 0.003","> 9","NO","NO","GRIS","GRIS"]
["QSI",0.5,0.5,1,1,1,1]
["QNO",1,1,0.5,0.5,0.5,0.5]
["Adaptación/Mitigación","¿Las especies elegidas generan sombra y regulan \n           térmicamente el espacio?","¿Qué superficie de suelo permeable contiene como pastos o \n         pastizales que favorecen la infiltración de agua ? ","¿Está ubicado cerca de un núcleo urbano y/o accesible \n         mediante movilidad activa?","¿Está ubicado cerca de un núcleo urbano y/o  accesible \n          mediante movilidad activa?","¿Está previsto el aumento de absorción de agua y \n          escorrentías para los temporales futuros de variabilidad \n          de precipitaciones?","¿Está ubicada cerca de un núcleo urbano y conectado con \n          otros? "]
["Adaptación/Mitigación","SI"," >50%","SI","SI","SI","SI"]
["Adaptación/Mitigación","NO","<50%","NO","NO","NO","NO"]
["Adaptación/Mitigación","NO SE","NO SE","NO SE","NO SE","NO SE","NO SE"]
["Adaptación/Mitigación",1.25,1.25,1.25,1.25,1.25,1.25]
["Adaptación/Mitigación",0.75,0.75,0.75,0.75,0.75,0.75]
["Adaptación/Mitigación",1,1,1,1,1,1]
["Ambientales ",null,"¿Contiene servicios de soporte  (diversidad de especies y \n          sus ecosistemas, humedales, polinizadores, etc.)?",null,"¿Contiene especies nativas y fomenta la agroecología y \n          sostenibilidad del uso de la tierra?","¿Contiene servicios de soporte? (diversidad de especies \n          y sus ecosistemas, humedales, polinizadores, etc.) ","¿Genera algún tipo de conectividad ecológica (diversidad \n          de especies y sus ecosistemas, humedales, polinizadores, \n          etc.)  "]
["Ambientales ",1.25,"SI",null,"SI","SI","SI"]
["Ambientales ",0.75,"NO",null,"NO","NO","NO"]
["Ambientales ",0.05,"NO SE",null,"NO SE","NO SE","NO SE"]
["Ambientales ",1,1.25,null,1.25,1.25,1.25]
[null,null,0.75,null,0.75,0.75,0.75]
[null,null,1,null,1,1,1]
["Sociales","¿Las especies elegidas añaden valores aspectos estéticos \n          y generan recursos comunitarios (como alimentos, plantas \n          o elementos florales culturales)?",null,"¿Sirve como punto de encuentro vecinal, espacio para \n          talleres sobre educación ambiental u otros temas?","¿Sirven como punto de encuentro vecinal, espacio de \n          reivindicación de ideas y propuestas  ?","¿Incluye servicios culturales (deportes, ocio, etc)?","¿Incluye servicios culturales (deportes, ocio, etc)?"]
["Sociales","SI","SI","SI","SI","SI","SI"]
["Sociales","NO","NO","NO","NO","NO","NO"]
["Sociales","NO SE","NO SE","NO SE","NO SE","NO SE","NO SE"]
["Sociales",1.25,1.25,1.25,1.25,1.25,1.25]
["Sociales",0.75,0.75,0.75,0.75,0.75,0.75]
["Sociales",1,1,1,1,1,1]
["Económicos","¿Las especies optimiza la inversión y carece de regadío \n           y mantenimiento?","¿Contiene servicios de aprovisionamiento? (Alimentos, \n         recursos naturales, genera empleo)",null," ¿Incentiva la suficiencia para el consumo y \n          producción alimentaria?","¿Incentiva la economía local como resultado del manejo \n          paisajístico urbano?","¿Incentiva la economía local y aumenta el valor de la \n          propiedad como resultado del manejo paisajístico urbano?"]
["Económicos","SI","SI",null,"SI","SI","SI"]
["Económicos","NO","NO",null,"NO","NO","NO"]
["Económicos","NO SE","NO SE",null,"NO SE","NO SE","NO SE"]
["Económicos",1.25,1.25,null,1.25,1.25,1.25]
["Económicos",0.75,0.75,null,0.75,0.75,0.75]
["Económicos",1,1,null,1,1,1]

{"sheet":"RegistroB","index":15,"n_rows":20,"n_cols":86,"rows_kept":20,"cut":false,"hidden":true,"merged":[]}
["Código","Componentes","Presupuesto","Pregunta 1","Respuesta","Valor","Pregunta 1","Dato 1","Pregunta 2","Dato 2","Pregunta 3","Dato 3","Pregunta 4","Dato 4","Pregunta 5","Dato 5","Pregunta 6","Dato 6","Pregunta 7","Dato 7","Pregunta 8","Dato 8","Pregunta 9","Dato 9","Pregunta 10 ","Dato 10",null,"Pregunta clave","Dato Q","Dato q1","Climático","β1","Ambientales","β2","Sociales ","β3","Económicos","β4",null,null,null,1,2,3,4,5,6,7,8,9,10,11,12,13,14,15,16,17,18,19,20,"Suma componente",null,null,null,1,2,3,4,5,6,7,8,9,10,11,12,13,14,15,16,17,18,19,20,"Suma"]
["CB1",{"$f":"Biodiversidad!B3","v":"ARBOLADO"},{"$f":"'2b Componentes Biodiversidad'!R24","v":0},{"$f":"Biodiversidad!B6","v":"¿El proyecto incluye un área verde con árboles, pastos, y/o es una superficie permeable (pasto, adopasto, adoquín)?"},"NO",{"$f":"IF(E2=\"NO\",0,1)","v":0},{"$f":"Biodiversidad!B8","v":"< 5m"},{"$f":"'2b Componentes Biodiversidad'!R29","v":0},{"$f":"Biodiversidad!B13","v":"¿Qué especie?"},{"$f":"'2b Componentes Biodiversidad'!T29","v":0},{"$f":"Biodiversidad!B9","v":"5m < 10m"},{"$f":"'2b Componentes Biodiversidad'!R32:R33","v":0},{"$f":"Biodiversidad!B13","v":"¿Qué especie?"},{"$f":"'2b Componentes Biodiversidad'!T32","v":0},{"$f":"'2b Componentes Biodiversidad'!O35","v":"          10m < 15m"},{"$f":"'2b Componentes Biodiversidad'!R35","v":0},{"$f":"Biodiversidad!B13","v":"¿Qué especie?"},{"$f":"'2b Componentes Biodiversidad'!T35","v":0},{"$f":"Biodiversidad!B11","v":"15m < 20m"},{"$f":"'2b Componentes Biodiversidad'!R38","v":0},{"$f":"Biodiversidad!B13","v":"¿Qué especie?"},{"$f":"'2b Componentes Biodiversidad'!T38","v":0},{"$f":"'2b Componentes Biodiversidad'!O41","v":"          >20m"},{"$f":"'2b Componentes Biodiversidad'!R41","v":0},{"$f":"Biodiversidad!B13","v":"¿Qué especie?"},{"$f":"'2b Componentes Biodiversidad'!T41","v":0},null,{"$f":"Biodiversidad!B25","v":"¿Cuál es la unidad de arbolado por hectárea? \n           (uA/ha)(ID OMS - 1ud/3hab)"},{"$f":"'2b Componentes Biodiversidad'!V47","v":0},{"$f":"IF(AC2=0,1,IF(AC2=\"0 - 0,003\",Biodiversidad!B28,Biodiversidad!B29))","v":1},{"$f":"'2b Componentes Biodiversidad'!V50","v":0},{"$f":"IF(AE2=0,1,IF(AE2=Biodiversidad!B31,Biodiversidad!B34,IF(AE2=Biodiversidad!B32,Biodiversidad!B35,Biodiversidad!B36)))","v":1},null,{"$f":"IF(COUNTIF(N2:Z2,Biodiversidad!B18)*Biodiversidad!B38+(COUNTIF(RegistroB!N2:Z2,Biodiversidad!B19)*Biodiversidad!B39)+(COUNTIF(RegistroB!N2:Z2,Biodiversidad!B20)*Biodiversidad!B40)=0,1,(COUNTIF(N2:Z2,Biodiversidad!B18)*Biodiversidad!B38+(COUNTIF(RegistroB!N2:Z2,Biodiversidad!B19)*Biodiversidad!B39)+(COUNTIF(RegistroB!N2:Z2,Biodiversidad!B20)*Biodiversidad!B40))/4)","v":1},{"$f":"'2b Componentes Biodiversidad'!V53","v":0},{"$f":"IF(AI2=0,1,IF(AI2=Biodiversidad!B45,Biodiversidad!B48,IF(AI2=Biodiversidad!B46,Biodiversidad!B49,Biodiversidad!B50)))","v":1},{"$f":"'2b Componentes Biodiversidad'!V57","v":0},{"$f":"IF(AK2=0,1,IF(AK2=Biodiversidad!B52,Biodiversidad!B55,IF(AK2=Biodiversidad!B53,Biodiversidad!B56,Biodiversidad!B57)))","v":1},null,null,null,{"$f":"IF($E2=\"SI\",VLOOKUP((CONCATENATE($A2,AP$1)),'Impactos Data'!$F$2:$G$521,2,FALSE),0)","v":0},{"$f":"IF($E2=\"SI\",VLOOKUP((CONCATENATE($A2,AQ$1)),'Impactos Data'!$F$2:$G$521,2,FALSE),0)","v":0},{"$f":"IF($E2=\"SI\",VLOOKUP((CONCATENATE($A2,AR$1)),'Impactos Data'!$F$2:$G$521,2,FALSE),0)","v":0},{"$f":"IF($E2=\"SI\",VLOOKUP((CONCATENATE($A2,AS$1)),'Impactos Data'!$F$2:$G$521,2,FALSE),0)","v":0},{"$f":"IF($E2=\"SI\",VLOOKUP((CONCATENATE($A2,AT$1)),'Impactos Data'!$F$2:$G$521,2,FALSE),0)","v":0},{"$f":"IF($E2=\"SI\",VLOOKUP((CONCATENATE($A2,AU$1)),'Impactos Data'!$F$2:$G$521,2,FALSE),0)","v":0},{"$f":"IF($E2=\"SI\",VLOOKUP((CONCATENATE($A2,AV$1)),'Impactos Data'!$F$2:$G$521,2,FALSE),0)","v":0},{"$f":"IF($E2=\"SI\",VLOOKUP((CONCATENATE($A2,AW$1)),'Impactos Data'!$F$2:$G$521,2,FALSE),0)","v":0},{"$f":"IF($E2=\"SI\",VLOOKUP((CONCATENATE($A2,AX$1)),'Impactos Data'!$F$2:$G$521,2,FALSE),0)","v":0},{"$f":"IF($E2=\"SI\",VLOOKUP((CONCATENATE($A2,AY$1)),'Impactos Data'!$F$2:$G$521,2,FALSE),0)","v":0},{"$f":"IF($E2=\"SI\",VLOOKUP((CONCATENATE($A2,AZ$1)),'Impactos Data'!$F$2:$G$521,2,FALSE),0)","v":0},{"$f":"IF($E2=\"SI\",VLOOKUP((CONCATENATE($A2,BA$1)),'Impactos Data'!$F$2:$G$521,2,FALSE),0)","v":0},{"$f":"IF($E2=\"SI\",VLOOKUP((CONCATENATE($A2,BB$1)),'Impactos Data'!$F$2:$G$521,2,FALSE),0)","v":0},{"$f":"IF($E2=\"SI\",VLOOKUP((CONCATENATE($A2,BC$1)),'Impactos Data'!$F$2:$G$521,2,FALSE),0)","v":0},{"$f":"IF($E2=\"SI\",VLOOKUP((CONCATENATE($A2,BD$1)),'Impactos Data'!$F$2:$G$521,2,FALSE),0)","v":0},{"$f":"IF($E2=\"SI\",VLOOKUP((CONCATENATE($A2,BE$1)),'Impactos Data'!$F$2:$G$521,2,FALSE),0)","v":0},{"$f":"IF($E2=\"SI\",VLOOKUP((CONCATENATE($A2,BF$1)),'Impactos Data'!$F$2:$G$521,2,FALSE),0)","v":0},{"$f":"IF($E2=\"SI\",VLOOKUP((CONCATENATE($A2,BG$1)),'Impactos Data'!$F$2:$G$521,2,FALSE),0)","v":0},{"$f":"IF($E2=\"SI\",VLOOKUP((CONCATENATE($A2,BH$1)),'Impactos Data'!$F$2:$G$521,2,FALSE),0)","v":0},{"$f":"IF($E2=\"SI\",VLOOKUP((CONCATENATE($A2,BI$1)),'Impactos Data'!$F$2:$G$521,2,FALSE),0)","v":0},{"$f":"SUM(AP2:BI2)","v":0},null,null,null,{"$f":"AP2*$AD2*$AF2","v":0},{"$f":"AQ2*$AD2*$AF2","v":0},0,0,0,0,0,{"$f":"AW2*$AD2*$AH2","v":0},{"$f":"AX2*$AD2*$AH2","v":0},0,0,0,0,{"$f":"BC2*$AD2*$AJ2","v":0},{"$f":"BD2*$AD2*$AJ2","v":0},0,0,0,{"$f":"BH2*$AD2*$AL2","v":0},{"$f":"BI2*$AD2*$AL2","v":0},{"$f":"SUM(BN2:CG2)","v":0}]
["CB2",{"$f":"Biodiversidad!C3","v":"BOSQUE URBANO"},{"$f":"'2b Componentes Biodiversidad'!R62","v":0},{"$f":"Biodiversidad!C6","v":"¿El proyecto es o incluye un bosque urbano?"},"NO",{"$f":"IF(E3=\"NO\",0,1)","v":0},{"$f":"Biodiversidad!C7","v":"Hectáreas de bosque "},{"$f":"'2b Componentes Biodiversidad'!V65","v":0},{"$f":"Biodiversidad!C8","v":"¿Cuenta con infraestructura recreativa\n         y/o deportiva que promueva el encuentro?"},{"$f":"'2b Componentes Biodiversidad'!V68","v":0},null,0,null,null,null,null,null,null,null,null,null,null,null,null,null,null,null,{"$f":"Biodiversidad!C25","v":"¿Cuál es la relación del bosque urbano por habitante? \n        (M2av/hab) - (ID OMS 9m2 AV/hab)"},{"$f":"'2b Componentes Biodiversidad'!V71","v":0},{"$f":"IF(AC3=0,1,IF(AC3=\"0 - 9\",Biodiversidad!C28,Biodiversidad!C29))","v":1},{"$f":"'2b Componentes Biodiversidad'!V74","v":0},{"$f":"IF(AE3=0,1,IF(AE3=Biodiversidad!C31,Biodiversidad!C34,IF(AE3=Biodiversidad!C32,Biodiversidad!C35,Biodiversidad!C36)))","v":1},{"$f":"'2b Componentes Biodiversidad'!V77","v":0},{"$f":"IF(AG3=0,1,IF(AG3=Biodiversidad!C38,Biodiversidad!C41,IF(AG3=Biodiversidad!C39,Biodiversidad!C42,Biodiversidad!C43)))","v":1},{"$f":"'2b Componentes Biodiversidad'!V68","v":0},{"$f":"IF(AI3=0,1,IF(AI3=Biodiversidad!C45,Biodiversidad!C48,IF(AI3=Biodiversidad!C46,Biodiversidad!C49,Biodiversidad!C50)))","v":1},{"$f":"'2b Componentes Biodiversidad'!V80","v":0},{"$f":"IF(AK3=0,1,IF(AK3=Biodiversidad!C52,Biodiversidad!C55,IF(AK3=Biodiversidad!C53,Biodiversidad!C56,Biodiversidad!C57)))","v":1},null,null,null,{"$f":"IF($E3=\"SI\",VLOOKUP((CONCATENATE($A3,AP$1)),'Impactos Data'!$F$2:$G$521,2,FALSE),0)","v":0},{"$f":"IF($E3=\"SI\",VLOOKUP((CONCATENATE($A3,AQ$1)),'Impactos Data'!$F$2:$G$521,2,FALSE),0)","v":0},{"$f":"IF($E3=\"SI\",VLOOKUP((CONCATENATE($A3,AR$1)),'Impactos Data'!$F$2:$G$521,2,FALSE),0)","v":0},{"$f":"IF($E3=\"SI\",VLOOKUP((CONCATENATE($A3,AS$1)),'Impactos Data'!$F$2:$G$521,2,FALSE),0)","v":0},{"$f":"IF($E3=\"SI\",VLOOKUP((CONCATENATE($A3,AT$1)),'Impactos Data'!$F$2:$G$521,2,FALSE),0)","v":0},{"$f":"IF($E3=\"SI\",VLOOKUP((CONCATENATE($A3,AU$1)),'Impactos Data'!$F$2:$G$521,2,FALSE),0)","v":0},{"$f":"IF($E3=\"SI\",VLOOKUP((CONCATENATE($A3,AV$1)),'Impactos Data'!$F$2:$G$521,2,FALSE),0)","v":0},{"$f":"IF($E3=\"SI\",VLOOKUP((CONCATENATE($A3,AW$1)),'Impactos Data'!$F$2:$G$521,2,FALSE),0)","v":0},{"$f":"IF($E3=\"SI\",VLOOKUP((CONCATENATE($A3,AX$1)),'Impactos Data'!$F$2:$G$521,2,FALSE),0)","v":0},{"$f":"IF($E3=\"SI\",VLOOKUP((CONCATENATE($A3,AY$1)),'Impactos Data'!$F$2:$G$521,2,FALSE),0)","v":0},{"$f":"IF($E3=\"SI\",VLOOKUP((CONCATENATE($A3,AZ$1)),'Impactos Data'!$F$2:$G$521,2,FALSE),0)","v":0},{"$f":"IF($E3=\"SI\",VLOOKUP((CONCATENATE($A3,BA$1)),'Impactos Data'!$F$2:$G$521,2,FALSE),0)","v":0},{"$f":"IF($E3=\"SI\",VLOOKUP((CONCATENATE($A3,BB$1)),'Impactos Data'!$F$2:$G$521,2,FALSE),0)","v":0},{"$f":"IF($E3=\"SI\",VLOOKUP((CONCATENATE($A3,BC$1)),'Impactos Data'!$F$2:$G$521,2,FALSE),0)","v":0},{"$f":"IF($E3=\"SI\",VLOOKUP((CONCATENATE($A3,BD$1)),'Impactos Data'!$F$2:$G$521,2,FALSE),0)","v":0},{"$f":"IF($E3=\"SI\",VLOOKUP((CONCATENATE($A3,BE$1)),'Impactos Data'!$F$2:$G$521,2,FALSE),0)","v":0},{"$f":"IF($E3=\"SI\",VLOOKUP((CONCATENATE($A3,BF$1)),'Impactos Data'!$F$2:$G$521,2,FALSE),0)","v":0},{"$f":"IF($E3=\"SI\",VLOOKUP((CONCATENATE($A3,BG$1)),'Impactos Data'!$F$2:$G$521,2,FALSE),0)","v":0},{"$f":"IF($E3=\"SI\",VLOOKUP((CONCATENATE($A3,BH$1)),'Impactos Data'!$F$2:$G$521,2,FALSE),0)","v":0},{"$f":"IF($E3=\"SI\",VLOOKUP((CONCATENATE($A3,BI$1)),'Impactos Data'!$F$2:$G$521,2,FALSE),0)","v":0},{"$f":"SUM(AP3:BI3)","v":0},null,null,null,{"$f":"AP3*$AD3*$AF3","v":0},{"$f":"AQ3*$AD3*$AF3","v":0},{"$f":"AR3*$AD3*$AF3","v":0},{"$f":"AS3*$AD3*$AF3","v":0},{"$f":"AT3*$AD3*$AF3","v":0},{"$f":"AU3*$AD3*$AF3","v":0},{"$f":"AV3*$AD3*$AF3","v":0},{"$f":"AW3*$AD3*$AH3","v":0},{"$f":"AX3*$AD3*$AH3","v":0},{"$f":"AY3*$AD3*$AH3","v":0},{"$f":"AZ3*$AD3*$AH3","v":0},{"$f":"BA3*$AD3*$AH3","v":0},{"$f":"BB3*$AD3*$AH3","v":0},{"$f":"BC3*$AD3*$AJ3","v":0},{"$f":"BD3*$AD3*$AJ3","v":0},{"$f":"BE3*$AD3*$AJ3","v":0},{"$f":"BF3*$AD3*$AJ3","v":0},{"$f":"BG3*$AD3*$AJ3","v":0},{"$f":"BH3*$AD3*$AL3","v":0},{"$f":"BI3*$AD3*$AL3","v":0},{"$f":"SUM(BN3:CG3)","v":0}]
["CB3",{"$f":"Biodiversidad!D3","v":"JARDINES EDUCATIVOS"},{"$f":"'2b Componentes Biodiversidad'!R85","v":0},{"$f":"Biodiversidad!D6","v":"¿El proyecto es o incluye un jardín o parque educativo?"},"NO",0,{"$f":"Biodiversidad!D7","v":"¿Cuenta con arbolado? "},{"$f":"'2b Componentes Biodiversidad'!V88","v":"SI"},{"$f":"Biodiversidad!D8","v":"m2 de superficie"},{"$f":"'2b Componentes Biodiversidad'!V91","v":0},null,null,null,null,null,null,null,null,null,null,null,null,null,null,null,null,null,{"$f":"Biodiversidad!D25","v":"¿El espacio reutiliza suelo que se encontraba artificializado \n           o cubierto por concreto, asfalto u otro material? "},{"$f":"'2b Componentes Biodiversidad'!V94","v":"NO"},{"$f":"IF(AC4=0,1,IF(AC4=Biodiversidad!D26,Biodiversidad!D28,Biodiversidad!D29))","v":0.5},{"$f":"'2b Componentes Biodiversidad'!V97","v":"SI"},{"$f":"IF(AE4=0,1,IF(AE4=Biodiversidad!D31,Biodiversidad!D34,IF(AE4=Biodiversidad!D32,Biodiversidad!D35,Biodiversidad!D36)))","v":1.25},1,1,{"$f":"'2b Componentes Biodiversidad'!V100","v":"NO"},{"$f":"IF(AI4=0,1,IF(AI4=Biodiversidad!D45,Biodiversidad!D48,IF(AI4=Biodiversidad!D46,Biodiversidad!D49,Biodiversidad!D50)))","v":0.75},1,1,null,null,null,{"$f":"IF($E4=\"SI\",VLOOKUP((CONCATENATE($A4,AP$1)),'Impactos Data'!$F$2:$G$521,2,FALSE),0)","v":0},{"$f":"IF($E4=\"SI\",VLOOKUP((CONCATENATE($A4,AQ$1)),'Impactos Data'!$F$2:$G$521,2,FALSE),0)","v":0},{"$f":"IF($E4=\"SI\",VLOOKUP((CONCATENATE($A4,AR$1)),'Impactos Data'!$F$2:$G$521,2,FALSE),0)","v":0},{"$f":"IF($E4=\"SI\",VLOOKUP((CONCATENATE($A4,AS$1)),'Impactos Data'!$F$2:$G$521,2,FALSE),0)","v":0},{"$f":"IF($E4=\"SI\",VLOOKUP((CONCATENATE($A4,AT$1)),'Impactos Data'!$F$2:$G$521,2,FALSE),0)","v":0},{"$f":"IF($E4=\"SI\",VLOOKUP((CONCATENATE($A4,AU$1)),'Impactos Data'!$F$2:$G$521,2,FALSE),0)","v":0},{"$f":"IF($E4=\"SI\",VLOOKUP((CONCATENATE($A4,AV$1)),'Impactos Data'!$F$2:$G$521,2,FALSE),0)","v":0},{"$f":"IF($E4=\"SI\",VLOOKUP((CONCATENATE($A4,AW$1)),'Impactos Data'!$F$2:$G$521,2,FALSE),0)","v":0},{"$f":"IF($E4=\"SI\",VLOOKUP((CONCATENATE($A4,AX$1)),'Impactos Data'!$F$2:$G$521,2,FALSE),0)","v":0},{"$f":"IF($E4=\"SI\",VLOOKUP((CONCATENATE($A4,AY$1)),'Impactos Data'!$F$2:$G$521,2,FALSE),0)","v":0},{"$f":"IF($E4=\"SI\",VLOOKUP((CONCATENATE($A4,AZ$1)),'Impactos Data'!$F$2:$G$521,2,FALSE),0)","v":0},{"$f":"IF($E4=\"SI\",VLOOKUP((CONCATENATE($A4,BA$1)),'Impactos Data'!$F$2:$G$521,2,FALSE),0)","v":0},{"$f":"IF($E4=\"SI\",VLOOKUP((CONCATENATE($A4,BB$1)),'Impactos Data'!$F$2:$G$521,2,FALSE),0)","v":0},{"$f":"IF($E4=\"SI\",VLOOKUP((CONCATENATE($A4,BC$1)),'Impactos Data'!$F$2:$G$521,2,FALSE),0)","v":0},{"$f":"IF($E4=\"SI\",VLOOKUP((CONCATENATE($A4,BD$1)),'Impactos Data'!$F$2:$G$521,2,FALSE),0)","v":0},{"$f":"IF($E4=\"SI\",VLOOKUP((CONCATENATE($A4,BE$1)),'Impactos Data'!$F$2:$G$521,2,FALSE),0)","v":0},{"$f":"IF($E4=\"SI\",VLOOKUP((CONCATENATE($A4,BF$1)),'Impactos Data'!$F$2:$G$521,2,FALSE),0)","v":0},{"$f":"IF($E4=\"SI\",VLOOKUP((CONCATENATE($A4,BG$1)),'Impactos Data'!$F$2:$G$521,2,FALSE),0)","v":0},{"$f":"IF($E4=\"SI\",VLOOKUP((CONCATENATE($A4,BH$1)),'Impactos Data'!$F$2:$G$521,2,FALSE),0)","v":0},{"$f":"IF($E4=\"SI\",VLOOKUP((CONCATENATE($A4,BI$1)),'Impactos Data'!$F$2:$G$521,2,FALSE),0)","v":0},0,null,null,null,{"$f":"AP4*$AD4*$AF4","v":0},0,0,0,0,0,0,0,0,0,0,0,{"$f":"BB4*$AD4*$AH4","v":0},0,0,0,0,0,0,0,0]
["CB4",{"$f":"Biodiversidad!E3","v":"HUERTOS URBANOS"},{"$f":"'2b Componentes Biodiversidad'!R105","v":0},{"$f":"Biodiversidad!E6","v":"¿El proyecto es o incluye un huerto urbano?"},"NO",0,{"$f":"Biodiversidad!E7","v":"m2 superficie de huerto "},{"$f":"'2b Componentes Biodiversidad'!V111","v":0},{"$f":"Biodiversidad!E8","v":"kg de alimentos producidos / año (estimado)"},{"$f":"'2b Componentes Biodiversidad'!V114","v":0},null,null,null,null,null,null,null,null,null,null,null,null,null,null,null,null,null,{"$f":"Biodiversidad!E25","v":"¿El espacio reutiliza suelo que se encontraba artificializado \n           o cubierto por concreto, asfalto u otro material? "},{"$f":"'2b Componentes Biodiversidad'!V114","v":0},{"$f":"IF(AC5=0,1,IF(AC5=Biodiversidad!E26,Biodiversidad!E28,Biodiversidad!E29))","v":1},{"$f":"'2b Componentes Biodiversidad'!V117","v":0},{"$f":"IF(AE5=0,1,IF(AE5=Biodiversidad!E31,Biodiversidad!E34,IF(AE5=Biodiversidad!E32,Biodiversidad!E35,Biodiversidad!E36)))","v":1},{"$f":"'2b Componentes Biodiversidad'!V120","v":0},{"$f":"IF(AG5=0,1,IF(AG5=Biodiversidad!E38,Biodiversidad!E41,IF(AG5=Biodiversidad!E39,Biodiversidad!E42,Biodiversidad!E43)))","v":1},{"$f":"'2b Componentes Biodiversidad'!V123","v":0},{"$f":"IF(AI5=0,1,IF(AI5=Biodiversidad!E45,Biodiversidad!E48,IF(AI5=Biodiversidad!E46,Biodiversidad!E49,Biodiversidad!E50)))","v":1},{"$f":"'2b Componentes Biodiversidad'!V126","v":0},{"$f":"IF(AK5=0,1,IF(AK5=Biodiversidad!E52,Biodiversidad!E55,IF(AK5=Biodiversidad!E53,Biodiversidad!E56,Biodiversidad!E57)))","v":1},null,null,null,{"$f":"IF($E5=\"SI\",VLOOKUP((CONCATENATE($A5,AP$1)),'Impactos Data'!$F$2:$G$521,2,FALSE),0)","v":0},{"$f":"IF($E5=\"SI\",VLOOKUP((CONCATENATE($A5,AQ$1)),'Impactos Data'!$F$2:$G$521,2,FALSE),0)","v":0},{"$f":"IF($E5=\"SI\",VLOOKUP((CONCATENATE($A5,AR$1)),'Impactos Data'!$F$2:$G$521,2,FALSE),0)","v":0},{"$f":"IF($E5=\"SI\",VLOOKUP((CONCATENATE($A5,AS$1)),'Impactos Data'!$F$2:$G$521,2,FALSE),0)","v":0},{"$f":"IF($E5=\"SI\",VLOOKUP((CONCATENATE($A5,AT$1)),'Impactos Data'!$F$2:$G$521,2,FALSE),0)","v":0},{"$f":"IF($E5=\"SI\",VLOOKUP((CONCATENATE($A5,AU$1)),'Impactos Data'!$F$2:$G$521,2,FALSE),0)","v":0},{"$f":"IF($E5=\"SI\",VLOOKUP((CONCATENATE($A5,AV$1)),'Impactos Data'!$F$2:$G$521,2,FALSE),0)","v":0},{"$f":"IF($E5=\"SI\",VLOOKUP((CONCATENATE($A5,AW$1)),'Impactos Data'!$F$2:$G$521,2,FALSE),0)","v":0},{"$f":"IF($E5=\"SI\",VLOOKUP((CONCATENATE($A5,AX$1)),'Impactos Data'!$F$2:$G$521,2,FALSE),0)","v":0},{"$f":"IF($E5=\"SI\",VLOOKUP((CONCATENATE($A5,AY$1)),'Impactos Data'!$F$2:$G$521,2,FALSE),0)","v":0},{"$f":"IF($E5=\"SI\",VLOOKUP((CONCATENATE($A5,AZ$1)),'Impactos Data'!$F$2:$G$521,2,FALSE),0)","v":0},{"$f":"IF($E5=\"SI\",VLOOKUP((CONCATENATE($A5,BA$1)),'Impactos Data'!$F$2:$G$521,2,FALSE),0)","v":0},{"$f":"IF($E5=\"SI\",VLOOKUP((CONCATENATE($A5,BB$1)),'Impactos Data'!$F$2:$G$521,2,FALSE),0)","v":0},{"$f":"IF($E5=\"SI\",VLOOKUP((CONCATENATE($A5,BC$1)),'Impactos Data'!$F$2:$G$521,2,FALSE),0)","v":0},{"$f":"IF($E5=\"SI\",VLOOKUP((CONCATENATE($A5,BD$1)),'Impactos Data'!$F$2:$G$521,2,FALSE),0)","v":0},{"$f":"IF($E5=\"SI\",VLOOKUP((CONCATENATE($A5,BE$1)),'Impactos Data'!$F$2:$G$521,2,FALSE),0)","v":0},{"$f":"IF($E5=\"SI\",VLOOKUP((CONCATENATE($A5,BF$1)),'Impactos Data'!$F$2:$G$521,2,FALSE),0)","v":0},{"$f":"IF($E5=\"SI\",VLOOKUP((CONCATENATE($A5,BG$1)),'Impactos Data'!$F$2:$G$521,2,FALSE),0)","v":0},{"$f":"IF($E5=\"SI\",VLOOKUP((CONCATENATE($A5,BH$1)),'Impactos Data'!$F$2:$G$521,2,FALSE),0)","v":0},{"$f":"IF($E5=\"SI\",VLOOKUP((CONCATENATE($A5,BI$1)),'Impactos Data'!$F$2:$G$521,2,FALSE),0)","v":0},0,null,null,null,0,0,0,0,0,0,0,0,0,0,0,0,0,0,0,0,0,0,0,0,0]
["CB5",{"$f":"Biodiversidad!F3","v":"RENATURALIZACION DE ELEMENTOS FLUVIALES"},{"$f":"'2b Componentes Biodiversidad'!R131","v":0},{"$f":"Biodiversidad!F6","v":"¿El proyecto es o incluye una renaturalización de elementos fluviales ?"},"NO",0,{"$f":"Biodiversidad!F7","v":"Hectáreas de la superficie de laderas recuperada"},{"$f":"'2b Componentes Biodiversidad'!V134","v":0},{"$f":"Biodiversidad!F8","v":"m2 de sección hidráulica de la propuesta "},{"$f":"'2b Componentes Biodiversidad'!V137","v":0},null,null,null,null,null,null,null,null,null,null,null,null,null,null,null,null,null,{"$f":"Biodiversidad!F25","v":"¿La renaturalización se ha hecho de forma natural o sobre \n          infraestructura gris?"},{"$f":"'2b Componentes Biodiversidad'!V140","v":0},{"$f":"IF(AC6=0,1,IF(AC6=Biodiversidad!F26,Biodiversidad!F28,Biodiversidad!F29))","v":1},{"$f":"'2b Componentes Biodiversidad'!V143","v":0},{"$f":"IF(AE6=0,1,IF(AE6=Biodiversidad!F31,Biodiversidad!F34,IF(AE6=Biodiversidad!F32,Biodiversidad!F35,Biodiversidad!F36)))","v":1},{"$f":"'2b Componentes Biodiversidad'!V147","v":0},{"$f":"IF(AG6=0,1,IF(AG6=Biodiversidad!F38,Biodiversidad!F41,IF(AG6=Biodiversidad!F39,Biodiversidad!F42,Biodiversidad!F43)))","v":1},{"$f":"'2b Componentes Biodiversidad'!V150","v":0},{"$f":"IF(AI6=0,1,IF(AI6=Biodiversidad!F45,Biodiversidad!F48,IF(AI6=Biodiversidad!F46,Biodiversidad!F49,Biodiversidad!F50)))","v":1},{"$f":"'2b Componentes Biodiversidad'!V153","v":0},{"$f":"IF(AK6=0,1,IF(AK6=Biodiversidad!G52,Biodiversidad!G55,IF(AK6=Biodiversidad!G53,Biodiversidad!G56,Biodiversidad!G57)))","v":1},null,null,null,{"$f":"IF($E6=\"SI\",VLOOKUP((CONCATENATE($A6,AP$1)),'Impactos Data'!$F$2:$G$521,2,FALSE),0)","v":0},{"$f":"IF($E6=\"SI\",VLOOKUP((CONCATENATE($A6,AQ$1)),'Impactos Data'!$F$2:$G$521,2,FALSE),0)","v":0},{"$f":"IF($E6=\"SI\",VLOOKUP((CONCATENATE($A6,AR$1)),'Impactos Data'!$F$2:$G$521,2,FALSE),0)","v":0},{"$f":"IF($E6=\"SI\",VLOOKUP((CONCATENATE($A6,AS$1)),'Impactos Data'!$F$2:$G$521,2,FALSE),0)","v":0},{"$f":"IF($E6=\"SI\",VLOOKUP((CONCATENATE($A6,AT$1)),'Impactos Data'!$F$2:$G$521,2,FALSE),0)","v":0},{"$f":"IF($E6=\"SI\",VLOOKUP((CONCATENATE($A6,AU$1)),'Impactos Data'!$F$2:$G$521,2,FALSE),0)","v":0},{"$f":"IF($E6=\"SI\",VLOOKUP((CONCATENATE($A6,AV$1)),'Impactos Data'!$F$2:$G$521,2,FALSE),0)","v":0},{"$f":"IF($E6=\"SI\",VLOOKUP((CONCATENATE($A6,AW$1)),'Impactos Data'!$F$2:$G$521,2,FALSE),0)","v":0},{"$f":"IF($E6=\"SI\",VLOOKUP((CONCATENATE($A6,AX$1)),'Impactos Data'!$F$2:$G$521,2,FALSE),0)","v":0},{"$f":"IF($E6=\"SI\",VLOOKUP((CONCATENATE($A6,AY$1)),'Impactos Data'!$F$2:$G$521,2,FALSE),0)","v":0},{"$f":"IF($E6=\"SI\",VLOOKUP((CONCATENATE($A6,AZ$1)),'Impactos Data'!$F$2:$G$521,2,FALSE),0)","v":0},{"$f":"IF($E6=\"SI\",VLOOKUP((CONCATENATE($A6,BA$1)),'Impactos Data'!$F$2:$G$521,2,FALSE),0)","v":0},{"$f":"IF($E6=\"SI\",VLOOKUP((CONCATENATE($A6,BB$1)),'Impactos Data'!$F$2:$G$521,2,FALSE),0)","v":0},{"$f":"IF($E6=\"SI\",VLOOKUP((CONCATENATE($A6,BC$1)),'Impactos Data'!$F$2:$G$521,2,FALSE),0)","v":0},{"$f":"IF($E6=\"SI\",VLOOKUP((CONCATENATE($A6,BD$1)),'Impactos Data'!$F$2:$G$521,2,FALSE),0)","v":0},{"$f":"IF($E6=\"SI\",VLOOKUP((CONCATENATE($A6,BE$1)),'Impactos Data'!$F$2:$G$521,2,FALSE),0)","v":0},{"$f":"IF($E6=\"SI\",VLOOKUP((CONCATENATE($A6,BF$1)),'Impactos Data'!$F$2:$G$521,2,FALSE),0)","v":0},{"$f":"IF($E6=\"SI\",VLOOKUP((CONCATENATE($A6,BG$1)),'Impactos Data'!$F$2:$G$521,2,FALSE),0)","v":0},{"$f":"IF($E6=\"SI\",VLOOKUP((CONCATENATE($A6,BH$1)),'Impactos Data'!$F$2:$G$521,2,FALSE),0)","v":0},{"$f":"IF($E6=\"SI\",VLOOKUP((CONCATENATE($A6,BI$1)),'Impactos Data'!$F$2:$G$521,2,FALSE),0)","v":0},0,null,null,null,{"$f":"AP6*$AD6*$AF6","v":0},0,0,0,0,0,{"$f":"AV6*$AD6*$AF6","v":0},{"$f":"AW6*$AD6*$AH6","v":0},0,0,0,0,{"$f":"BB6*$AD6*$AH6","v":0},{"$f":"BC6*$AD6*$AJ6","v":0},0,0,0,0,{"$f":"BH6*$AD6*$AL6","v":0},{"$f":"BI6*$AD6*$AL6","v":0},0]
["CB6",{"$f":"Biodiversidad!G3","v":"DESENTUBADO DE RIOS"},{"$f":"'2b Componentes Biodiversidad'!R158","v":0},"¿El proyecto es o incluye un desentubamiento del rio ?","NO",0,{"$f":"Biodiversidad!G7","v":"Superficie permeable recuperada (m2)"},{"$f":"'2b Componentes Biodiversidad'!V161","v":0},{"$f":"Biodiversidad!G8","v":"Superficie natural recuperada (m2)"},{"$f":"'2b Componentes Biodiversidad'!V164","v":0},{"$f":"Biodiversidad!G9","v":"Número ejemplares arbóreos (árboles, arbustos, plantas)"},{"$f":"'2b Componentes Biodiversidad'!V167","v":0},null,null,null,null,null,null,null,null,null,null,null,null,null,null,null,{"$f":"Biodiversidad!G25","v":"¿El desentubado se ha hecho de forma natural (permeable)  \n        o sobre infraestructura gris (impermeable)?"},{"$f":"'2b Componentes Biodiversidad'!V170","v":0},{"$f":"IF(AC7=0,1,IF(AC7=Biodiversidad!G26,Biodiversidad!G28,Biodiversidad!G29))","v":1},{"$f":"'2b Componentes Biodiversidad'!V173","v":0},{"$f":"IF(AE7=0,1,IF(AE7=Biodiversidad!G31,Biodiversidad!G34,IF(AE7=Biodiversidad!G32,Biodiversidad!G35,Biodiversidad!G36)))","v":1},{"$f":"'2b Componentes Biodiversidad'!V176","v":0},{"$f":"IF(AG7=0,1,IF(AG7=Biodiversidad!G38,Biodiversidad!G41,IF(AG7=Biodiversidad!G39,Biodiversidad!G42,Biodiversidad!G43)))","v":1},{"$f":"'2b Componentes Biodiversidad'!V180","v":0},{"$f":"IF(AI7=0,1,IF(AI7=Biodiversidad!G45,Biodiversidad!G48,IF(AI7=Biodiversidad!G46,Biodiversidad!G49,Biodiversidad!G50)))","v":1},{"$f":"'2b Componentes Biodiversidad'!V183","v":0},{"$f":"IF(AK7=0,1,IF(AK7=Biodiversidad!G52,Biodiversidad!G55,IF(AK7=Biodiversidad!G53,Biodiversidad!G56,Biodiversidad!G57)))","v":1},null,null,null,{"$f":"IF($E7=\"SI\",VLOOKUP((CONCATENATE($A7,AP$1)),'Impactos Data'!$F$2:$G$521,2,FALSE),0)","v":0},{"$f":"IF($E7=\"SI\",VLOOKUP((CONCATENATE($A7,AQ$1)),'Impactos Data'!$F$2:$G$521,2,FALSE),0)","v":0},{"$f":"IF($E7=\"SI\",VLOOKUP((CONCATENATE($A7,AR$1)),'Impactos Data'!$F$2:$G$521,2,FALSE),0)","v":0},{"$f":"IF($E7=\"SI\",VLOOKUP((CONCATENATE($A7,AS$1)),'Impactos Data'!$F$2:$G$521,2,FALSE),0)","v":0},{"$f":"IF($E7=\"SI\",VLOOKUP((CONCATENATE($A7,AT$1)),'Impactos Data'!$F$2:$G$521,2,FALSE),0)","v":0},{"$f":"IF($E7=\"SI\",VLOOKUP((CONCATENATE($A7,AU$1)),'Impactos Data'!$F$2:$G$521,2,FALSE),0)","v":0},{"$f":"IF($E7=\"SI\",VLOOKUP((CONCATENATE($A7,AV$1)),'Impactos Data'!$F$2:$G$521,2,FALSE),0)","v":0},{"$f":"IF($E7=\"SI\",VLOOKUP((CONCATENATE($A7,AW$1)),'Impactos Data'!$F$2:$G$521,2,FALSE),0)","v":0},{"$f":"IF($E7=\"SI\",VLOOKUP((CONCATENATE($A7,AX$1)),'Impactos Data'!$F$2:$G$521,2,FALSE),0)","v":0},{"$f":"IF($E7=\"SI\",VLOOKUP((CONCATENATE($A7,AY$1)),'Impactos Data'!$F$2:$G$521,2,FALSE),0)","v":0},{"$f":"IF($E7=\"SI\",VLOOKUP((CONCATENATE($A7,AZ$1)),'Impactos Data'!$F$2:$G$521,2,FALSE),0)","v":0},{"$f":"IF($E7=\"SI\",VLOOKUP((CONCATENATE($A7,BA$1)),'Impactos Data'!$F$2:$G$521,2,FALSE),0)","v":0},{"$f":"IF($E7=\"SI\",VLOOKUP((CONCATENATE($A7,BB$1)),'Impactos Data'!$F$2:$G$521,2,FALSE),0)","v":0},{"$f":"IF($E7=\"SI\",VLOOKUP((CONCATENATE($A7,BC$1)),'Impactos Data'!$F$2:$G$521,2,FALSE),0)","v":0},{"$f":"IF($E7=\"SI\",VLOOKUP((CONCATENATE($A7,BD$1)),'Impactos Data'!$F$2:$G$521,2,FALSE),0)","v":0},{"$f":"IF($E7=\"SI\",VLOOKUP((CONCATENATE($A7,BE$1)),'Impactos Data'!$F$2:$G$521,2,FALSE),0)","v":0},{"$f":"IF($E7=\"SI\",VLOOKUP((CONCATENATE($A7,BF$1)),'Impactos Data'!$F$2:$G$521,2,FALSE),0)","v":0},{"$f":"IF($E7=\"SI\",VLOOKUP((CONCATENATE($A7,BG$1)),'Impactos Data'!$F$2:$G$521,2,FALSE),0)","v":0},{"$f":"IF($E7=\"SI\",VLOOKUP((CONCATENATE($A7,BH$1)),'Impactos Data'!$F$2:$G$521,2,FALSE),0)","v":0},{"$f":"IF($E7=\"SI\",VLOOKUP((CONCATENATE($A7,BI$1)),'Impactos Data'!$F$2:$G$521,2,FALSE),0)","v":0},0,null,null,null,0,0,0,0,0,0,0,0,0,0,0,0,0,0,0,0,0,0,0,0,0]
[]
[]
[]
[]
[]
[]
[]
[]
[]
[]
[]
[null,null,null,null,null,null,null,null,null,null,null,null,null,null,null,null,null,null,null,null,null,null,null,null,null,null,null,null,null,null,null,null,null,null,null,null,null,null,null,null,null,{"$f":"AP1","v":1},{"$f":"AQ1","v":2},3,4,5,6,7,8,9,10,11,12,13,14,15,16,17,18,19,20,null,null,null,null,{"$f":"BN1","v":1},{"$f":"BO1","v":2},3,4,5,6,7,8,9,10,11,12,13,14,15,16,17,18,19,20]
[null,"SUM SI",{"$f":"SUMPRODUCT(C2:C18,F2:F18)","v":0},"COUNT SI",{"$f":"COUNTIF(E2:E18,\"SI\")","v":0},null,null,null,null,null,null,null,"SUMA",null,null,null,null,null,null,null,null,null,null,null,null,null,null,null,null,null,null,null,null,null,null,null,null,null,null,null,null,{"$f":"SUM(AP2:AP7)","v":0},{"$f":"SUM(AQ2:AQ7)","v":0},0,0,0,0,0,0,0,0,0,0,0,0,0,0,0,0,0,0,null,null,null,null,{"$f":"SUM(BN2:BN7)","v":0},{"$f":"SUM(BO2:BO10)","v":0},0,0,0,0,0,0,0,0,0,0,0,0,0,0,0,0,0,0]

{"sheet":"2c. Componentes Movilidad","index":16,"n_rows":145,"n_cols":22,"rows_kept":145,"cut":false,"hidden":true,"merged":[[3,5,3,7],[3,9,3,12],[3,14,3,17],[3,19,3,22],[8,1,10,12],[13,1,13,9],[22,1,24,12],[23,14,23,16],[23,17,23,19],[25,14,26,20],[26,2,35,12],[26,13,40,13],[27,14,27,20],[28,15,28,20],[30,14,30,20],[31,15,31,20],[40,2,41,2],[40,3,42,12],[40,14,40,20],[41,15,41,20],[44,1,46,12],[45,14,45,16],[45,17,45,19],[33,14,33,20],[34,15,34,20],[36,2,39,12],[36,14,36,20],[37,15,37,20],[38,15,38,20],[48,21,49,21],[49,13,59,13],[51,14,52,19],[51,21,52,21],[54,14,55,19],[54,21,55,21],[57,14,58,20],[57,21,58,21],[67,21,68,21],[68,13,78,13],[70,14,71,19],[70,21,71,21],[73,14,74,19],[73,21,74,21],[67,14,68,19],[67,20,68,20],[87,13,95,13],[89,14,90,20],[89,21,90,21],[92,14,92,19],[93,14,94,20],[95,2,96,2],[115,1,117,12],[116,14,116,16],[116,17,116,19],[103,14,104,20],[103,21,104,21],[104,13,111,13],[106,14,107,20],[109,14,110,20],[111,2,112,2],[111,3,112,12],[99,1,101,12],[100,14,100,16],[100,17,100,19],[86,14,87,20],[95,3,96,12],[103,2,110,12],[86,2,94,12],[144,2,145,2],[144,3,145,12],[127,3,128,12],[131,1,133,12],[132,14,132,16],[132,17,132,19],[135,14,136,20],[135,21,136,21],[136,13,144,13],[138,14,139,20],[1,1,1,23],[67,2,77,12],[48,2,58,12],[135,2,143,12],[119,14,120,20],[76,14,77,20],[78,2,79,2],[78,3,79,12],[82,1,84,12],[83,14,83,16],[83,17,83,19],[59,2,60,2],[59,3,60,12],[63,1,65,12],[64,14,64,16],[64,17,64,19],[48,14,49,19],[119,21,120,21],[120,13,127,13],[125,14,126,20],[127,2,128,2],[142,14,143,20],[119,2,126,12],[86,21,87,21]]}
[]
[null,"Herramienta para la estimación y evaluación de los impactos de la infraestructura verde"]
[]
[null,null,null,null,null,"1. Introducción ",null,null,null,"2. Preparar evaluación ",null,null,null,null,"3. Recolección de datos",null,null,null,null,"4. Impactos/Resultados"]
[]
[null,null,null,null,null,null,"2a. Componentes AGUA",null,null,null,"2b. Componentes BIODIVERSIDAD",null,null,null,null,"2c. Componentes MOVILIDAD",null,null,null,null,"2d. Componentes ESPACIO PUBLICO"]
[]
[null,"Acerca de esta pestaña:"]
[null,"Esta pestaña tiene la definición de los componentes de IV del eje de Movilidad "]
[]
[]
[]
[]
[null,"2c. Selección de componentes de IV del eje MOVILIDAD"]
[]
[]
[]
[]
[]
[]
[]
[]
[null,{"$f":"\"    \"&Movilidad!B3","v":"    URBANISMO TÁCTICO"}]
[null,null,null,null,null,null,null,null,null,null,null,null,null,null,"Presupuesto asignado",null,null,0,null,null,null,{"$f":"Movilidad!B2","v":"CMO1"}]
[]
[null,null,null,null,null,null,null,null,null,null,null,null,null,null,{"$f":"Movilidad!B6","v":"¿Qué elementos se incorporan?"}]
[null,null,{"$f":"Movilidad!B4","v":"El urbanisto táctico se refiere a intervenciones  de corto plazo en el espacio público, por lo general de carácter temporal, pero pueden ser también permanentes y que buscan generar un cambio en la forma de habitar la ciudad para hacerla más funcional, amigable y sustentable."}]
[null,null,null,null,null,null,null,null,null,null,null,null,null,null,{"$f":"\"      \"&Movilidad!B8","v":"      Mobiliario Artístico"}]
[null,null,null,null,null,null,null,null,null,null,null,null,null,null,null,{"$f":"IF(V28=\"SI\",Movilidad!B13,\" \")","v":" "},null,null,null,null,null,"SI"]
[]
[null,null,null,null,null,null,null,null,null,null,null,null,null,null,{"$f":"\"      \"&Movilidad!B9","v":"      Tratamiento de pavimentos "}]
[null,null,null,null,null,null,null,null,null,null,null,null,null,null,null,{"$f":"IF(V31=\"SI\",Movilidad!B14,\" \")","v":" "},null,null,null,null,null,"SI"]
[]
[null,null,null,null,null,null,null,null,null,null,null,null,null,null,{"$f":"\"      \"&Movilidad!B10","v":"      Mejoramiento de cruceros"}]
[null,null,null,null,null,null,null,null,null,null,null,null,null,null,null,{"$f":"IF(V34=\"SI\",Movilidad!B15,\" \")","v":" "}]
[]
[null,null,null,null,null,null,null,null,null,null,null,null,null,null,{"$f":"\"      \"&Movilidad!B11","v":"      Mejoramiento de la iluminación"}]
[null,null,null,null,null,null,null,null,null,null,null,null,null,null,null,{"$f":"IF(V37=\"SI\",Movilidad!B16,\" \")","v":" "},null,null,null,null,null,"NO"]
[null,null,null,null,null,null,null,null,null,null,null,null,null,null,null,{"$f":"IF(V37=\"SI\",Movilidad!B17,\" \")","v":" "},null,null,null,null,null,"SI"]
[]
[null,null,{"$f":"IF(D41=0,\" \",\"Fuente:\")","v":"Fuente:"},{"$f":"Movilidad!B5","v":"CAF (s.f.) Guía Rápida de Urbanismo Táctico. Caso Piloto: Pereira. Asociación Colectivo Ciudadano Espacio & Ciudad. 12p. Disponible en: http://espacioyciudad.com/wp-content/uploads/2019/02/Guia_de_Urbanismo_Tactico_CAF_y_Espacio_y_Ciudad_2018_Final.pdf. Última consulta: 25.08.21)"},null,null,null,null,null,null,null,null,null,null,{"$f":"\"      \"&Movilidad!B12","v":"      Transformación de muros artísticos"}]
[null,null,null,null,null,null,null,null,null,null,null,null,null,null,null,{"$f":"IF(V41=\"SI\",\"\"&Movilidad!B18,\" \")","v":" "}]
[]
[]
[null,{"$f":"\"    \"&Movilidad!C3","v":"    CICLOVÍAS"}]
[null,null,null,null,null,null,null,null,null,null,null,null,null,null,"Presupuesto asignado",null,null,0,null,null,null,{"$f":"Movilidad!C2","v":"CMO2"}]
[]
[]
[null,null,{"$f":"Movilidad!C4","v":"Se refiere a la parte de la infraestructura pública destinada de forma exclusiva a la circulación de bicicletas que se encuentra delimitada con otro color o con símbolos pintados."},null,null,null,null,null,null,null,null,null,null,null,{"$f":"\"       \"&Movilidad!C7","v":"       ¿Disuade el uso del automóvil?"}]
[]
[]
[null,null,null,null,null,null,null,null,null,null,null,null,null,null,{"$f":"\"       \"&Movilidad!C8","v":"       ¿Hay tiendas y negocios alrededor?"}]
[]
[]
[null,null,null,null,null,null,null,null,null,null,null,null,null,null,{"$f":"\"       \"&Movilidad!C9","v":"       ¿Incluye arbolado?"}]
[]
[]
[null,null,null,null,null,null,null,null,null,null,null,null,null,null,{"$f":"\"       \"&Movilidad!C10","v":"       ¿Cuántos metros lineales de ciclovías?"}]
[]
[null,null,{"$f":"IF(D60=0,\" \",\"Fuente:\")","v":" "},{"$f":"Movilidad!C5","v":0}]
[]
[]
[]
[null,{"$f":"\"    \"&Movilidad!D3","v":"    CORREDOR PEATONAL "}]
[null,null,null,null,null,null,null,null,null,null,null,null,null,null,"Presupuesto asignado",null,null,0,null,null,null,{"$f":"Movilidad!D2","v":"CMO3"}]
[]
[]
[null,null,{"$f":"Movilidad!D4","v":"Se refiere a una vía de uso peatonal tanto urbana como periurbana que conecta al menos 2 puntos de relevancia ."},null,null,null,null,null,null,null,null,null,null,null,{"$f":"\"       \"&Movilidad!D7","v":"       ¿Genera diferentes usos recreativos o deportivos?"}]
[]
[]
[null,null,null,null,null,null,null,null,null,null,null,null,null,null,{"$f":"\"       \"&Movilidad!D8","v":"       ¿Incluye vegetación o arbolado?"}]
[]
[]
[null,null,null,null,null,null,null,null,null,null,null,null,null,null,{"$f":"\"       \"&Movilidad!D20","v":"       ¿El corredor implantado genera usos recreativos, \n        comerciales o deportivos?"}]
[]
[]
[]
[]
[null,null,{"$f":"IF(D79=0,\" \",\"Fuente:\")","v":" "},{"$f":"Movilidad!D5","v":0}]
[]
[]
[]
[null,{"$f":"\"    \"&Movilidad!E3","v":"    BANQUETAS"}]
[null,null,null,null,null,null,null,null,null,null,null,null,null,null,"Presupuesto asignado",null,null,0,null,null,null,{"$f":"Movilidad!E2","v":"CMO4"}]
[]
[]
[null,null,{"$f":"Movilidad!E4","v":"Se refiere a la franja de la calle cuya función es servir de superficie peatonal para su protección. Se encuentra entre la superficie de rodamiento y el alineamiento de los predios y puede incluir franjas para areas verdes, arbolado urbano y la introducción de infraestructurra hidráulica, sanitaria y eléctrica."},null,null,null,null,null,null,null,null,null,null,null,{"$f":"\"       \"&Movilidad!E7","v":"       ¿Cuál es el ancho (superficie aprox) de la introducción o \n       ampliación de banqueta?"}]
[]
[]
[null,null,null,null,null,null,null,null,null,null,null,null,null,null,{"$f":"\"       \"&Movilidad!E8","v":"       ¿Cuenta con pavimento infiltrante, cuneta verde o jardinera?"}]
[]
[]
[]
[]
[]
[null,null,{"$f":"IF(D96=0,\" \",\"Fuente:\")","v":"Fuente:"},{"$f":"Movilidad!E5","v":"Curso de calles e infraestructura Verde del programa CiClim. GIZ, SEDATU y SEMARNA"}]
[]
[]
[]
[null,{"$f":"\"    \"&Movilidad!F3","v":"    ZONA TRANSPORTE PÚBLICO"}]
[null,null,null,null,null,null,null,null,null,null,null,null,null,null,"Presupuesto asignado",null,null,0,null,null,null,{"$f":"Movilidad!F2","v":"CMO5"}]
[]
[]
[null,null,{"$f":"Movilidad!F4","v":"Se refiere a la parte de la infraestructura pública destinada de forma exclusiva a la circulación de transporte público. Se encuentra delimitada con otro color o con símbolos pintados."},null,null,null,null,null,null,null,null,null,null,null,{"$f":"\"       \"&Movilidad!F7","v":"       metros lineales de carril transporte público"}]
[null,null,null,null,null,null,null,null,null,null,null,null,null,null,null,null,null,null,null,null,null,"SI"]
[]
[]
[]
[]
[]
[]
[null,null,{"$f":"IF(D112=0,\" \",\"Fuente:\")","v":"Fuente:"},{"$f":"Movilidad!F5","v":"Módulo 2_Diseño urbano e Infraestructura Verde del “Curso de calles e infraestructura Verde del programa CiClim. GIZ, SEDATU y SEMARNAT"}]
[]
[]
[]
[null,{"$f":"\"    \"&Movilidad!G3","v":"    ZONA CARGA SOSTENIBLE"}]
[null,null,null,null,null,null,null,null,null,null,null,null,null,null,"Presupuesto asignado",null,null,0,null,null,null,{"$f":"Movilidad!G2","v":"CMO6"}]
[]
[]
[null,null,{"$f":"Movilidad!G4","v":"Se refiere a la parte de la infraestructura pública destinada de forma exclusiva a la carga y descarga de materiales. Se encuentra delimitada con otro color o con símbolos pintados."},null,null,null,null,null,null,null,null,null,null,null,{"$f":"\"       \"&Movilidad!G7","v":"       metros lineales de carril para carga/descarga "}]
[null,null,null,null,null,null,null,null,null,null,null,null,null,null,null,null,null,null,null,null,null,"SI"]
[]
[]
[]
[]
[]
[]
[null,null,{"$f":"IF(D128=0,\" \",\"Fuente:\")","v":"Fuente:"},{"$f":"Movilidad!G5","v":"Módulo 2_Diseño urbano e Infraestructura Verde del “Curso de calles e infraestructura Verde del programa CiClim. GIZ, SEDATU y SEMARNAT"}]
[]
[]
[]
[null,{"$f":"\"    \"&Movilidad!H3","v":"    ZONA VEHÍCULO PRIVADO SOSTENIBLE"}]
[null,null,null,null,null,null,null,null,null,null,null,null,null,null,"Presupuesto asignado",null,null,0,null,null,null,{"$f":"Movilidad!H2","v":"CMO7"}]
[]
[]
[null,null,{"$f":"Movilidad!H4","v":"Se refiere a la parte de la infraestructura pública destinada de forma exclusiva a la circulación de vehículo privado sostenible (Vehículos ECO/0 Emisiones). Se encuentra delimitada con otro color o con símbolos pintados."},null,null,null,null,null,null,null,null,null,null,null,{"$f":"\"       \"&Movilidad!H7","v":"       metros lineales de carril para vehículo sostenible "}]
[null,null,null,null,null,null,null,null,null,null,null,null,null,null,null,null,null,null,null,null,null,"SI"]
[]
[]
[]
[]
[]
[]
[]
[null,null,{"$f":"IF(D145=0,\" \",\"Fuente:\")","v":"Fuente:"},{"$f":"Movilidad!H5","v":"Nuevas tecnologías del “Curso de calles e infraestructura Verde del programa CiClim. GIZ, SEDATU y SEMARNAT"}]

{"sheet":"Movilidad","index":17,"n_rows":26,"n_cols":8,"rows_kept":26,"cut":false,"hidden":true,"merged":[]}
["Eje","Movilidad","Movilidad","Movilidad","Movilidad","Movilidad","Movilidad","Movilidad"]
["Código","CMO1","CMO2","CMO3","CMO4","CMO5","CMO6","CMO7"]
["Componentes","URBANISMO TÁCTICO","CICLOVÍAS","CORREDOR PEATONAL ","BANQUETAS","ZONA TRANSPORTE PÚBLICO","ZONA CARGA SOSTENIBLE","ZONA VEHÍCULO PRIVADO SOSTENIBLE"]
["Descripción","El urbanisto táctico se refiere a intervenciones  de corto plazo en el espacio público, por lo general de carácter temporal, pero pueden ser también permanentes y que buscan generar un cambio en la forma de habitar la ciudad para hacerla más funcional, amigable y sustentable.","Se refiere a la parte de la infraestructura pública destinada de forma exclusiva a la circulación de bicicletas que se encuentra delimitada con otro color o con símbolos pintados.","Se refiere a una vía de uso peatonal tanto urbana como periurbana que conecta al menos 2 puntos de relevancia .","Se refiere a la franja de la calle cuya función es servir de superficie peatonal para su protección. Se encuentra entre la superficie de rodamiento y el alineamiento de los predios y puede incluir franjas para areas verdes, arbolado urbano y la introducción de infraestructurra hidráulica, sanitaria y eléctrica.","Se refiere a la parte de la infraestructura pública destinada de forma exclusiva a la circulación de transporte público. Se encuentra delimitada con otro color o con símbolos pintados.","Se refiere a la parte de la infraestructura pública destinada de forma exclusiva a la carga y descarga de materiales. Se encuentra delimitada con otro color o con símbolos pintados.","Se refiere a la parte de la infraestructura pública destinada de forma exclusiva a la circulación de vehículo privado sostenible (Vehículos ECO/0 Emisiones). Se encuentra delimitada con otro color o con símbolos pintados."]
["Referencia","CAF (s.f.) Guía Rápida de Urbanismo Táctico. Caso Piloto: Pereira. Asociación Colectivo Ciudadano Espacio & Ciudad. 12p. Disponible en: http://espacioyciudad.com/wp-content/uploads/2019/02/Guia_de_Urbanismo_Tactico_CAF_y_Espacio_y_Ciudad_2018_Final.pdf. Última consulta: 25.08.21)",null,null,"Curso de calles e infraestructura Verde del programa CiClim. GIZ, SEDATU y SEMARNA","Módulo 2_Diseño urbano e Infraestructura Verde del “Curso de calles e infraestructura Verde del programa CiClim. GIZ, SEDATU y SEMARNAT","Módulo 2_Diseño urbano e Infraestructura Verde del “Curso de calles e infraestructura Verde del programa CiClim. GIZ, SEDATU y SEMARNAT","Nuevas tecnologías del “Curso de calles e infraestructura Verde del programa CiClim. GIZ, SEDATU y SEMARNAT"]
["Pregunta 1","¿Qué elementos se incorporan?","¿El proyecto incluye cicovías?","¿En el proyecto dispone de algún corredor peatonal?","¿El proyecto propone la introducción o ampliación de las banquetas?","¿El proyecto incluye zonas de transporte público?","¿El proyecto incluye zona de carga y descarga sostenible?","¿El proyecto incluye zona de vehículo privado sostenible?"]
["Pregunta 1SI",null,"¿Disuade el uso del automóvil?","¿Genera diferentes usos recreativos o deportivos?","¿Cuál es el ancho (superficie aprox) de la introducción o \n       ampliación de banqueta?","metros lineales de carril transporte público","metros lineales de carril para carga/descarga ","metros lineales de carril para vehículo sostenible "]
["Pregunta 2SI","Mobiliario Artístico","¿Hay tiendas y negocios alrededor?","¿Incluye vegetación o arbolado?","¿Cuenta con pavimento infiltrante, cuneta verde o jardinera?"]
["Pregunta 3SI","Tratamiento de pavimentos ","¿Incluye arbolado?"]
["Pregunta 4SI","Mejoramiento de cruceros","¿Cuántos metros lineales de ciclovías?"]
["Pregunta5SI","Mejoramiento de la iluminación"]
["Pregunta6SI","Transformación de muros artísticos"]
["Pregunta2SISI","¿Cuenta con arbolado?"]
["Pregunta 3SISI","¿Incluye pavimentos filtrantes?"]
["Pregunta 4SISI","¿Disuade el uso del automóvil?"]
["Pregunta5SISIa","¿Genera ahorros de energética eléctrica?"]
["Pregunta5SISIb","¿Es un proyecto de energía renovable?"]
["Pregunta6SISI","¿Induce mobilidad activa?"]
[]
["Pregunta Q1",null,null,"¿El corredor implantado genera usos recreativos, \n        comerciales o deportivos?","¿Cuál es el ancho (superficie aprox) de la introducción o ampliación de banqueta?"]
["RQ1",null,null,"SI","<2,00 m"]
["RQ2",null,null,"NO","2,00 a 5,20 m"]
["QSI",null,null,1,"5,20 a 7,60 m"]
["QNO",null,null,0.5,0.25]
[null,null,null,null,0.5]
[null,null,null,null,1]

{"sheet":"RegistroM","index":18,"n_rows":21,"n_cols":72,"rows_kept":21,"cut":false,"hidden":true,"merged":[]}
["Código","Componentes","Presupuesto","Pregunta 1","Respuesta","Valor","Pregunta 1SI","Dato 1","Pregunta 2SI","Dato 2","Pregunta 3SI","Dato 3","Pregunta 4SI","Dato 4","Pregunta 5SI","Dato 5","Pregunta 6SI",null,null,"Pregunta clave","Dato Q","Dato q1",null,null,null,null,null,1,2,3,4,5,6,7,8,9,10,11,12,13,14,15,16,17,18,19,20,"Suma componente",null,null,null,1,2,3,4,5,6,7,8,9,10,11,12,13,14,15,16,17,18,19,20,"Suma"]
["CMO1",{"$f":"Movilidad!B3","v":"URBANISMO TÁCTICO"},{"$f":"'2c. Componentes Movilidad'!R24","v":0},{"$f":"Movilidad!B$6","v":"¿Qué elementos se incorporan?"},"NO",{"$f":"IF(E2=\"NO\",0,1)","v":0},{"$f":"Movilidad!B8","v":"Mobiliario Artístico"},{"$f":"'2c. Componentes Movilidad'!V28","v":0},{"$f":"Movilidad!B9","v":"Tratamiento de pavimentos "},{"$f":"'2c. Componentes Movilidad'!V31","v":0},{"$f":"Movilidad!B10","v":"Mejoramiento de cruceros"},{"$f":"'2c. Componentes Movilidad'!V34","v":0},{"$f":"Movilidad!B11","v":"Mejoramiento de la iluminación"},{"$f":"'2c. Componentes Movilidad'!V37","v":0},{"$f":"Movilidad!B12","v":"Transformación de muros artísticos"},{"$f":"'2c. Componentes Movilidad'!V41","v":0},null,null,null,null,null,1,null,null,null,null,null,{"$f":"IF($E2=\"SI\",VLOOKUP((CONCATENATE($A2,AB$1)),'Impactos Data'!$F$2:$G$521,2,FALSE),0)","v":0},{"$f":"IF($E2=\"SI\",VLOOKUP((CONCATENATE($A2,AC$1)),'Impactos Data'!$F$2:$G$521,2,FALSE),0)","v":0},{"$f":"IF($E2=\"SI\",VLOOKUP((CONCATENATE($A2,AD$1)),'Impactos Data'!$F$2:$G$521,2,FALSE),0)","v":0},{"$f":"IF($E2=\"SI\",VLOOKUP((CONCATENATE($A2,AE$1)),'Impactos Data'!$F$2:$G$521,2,FALSE),0)","v":0},{"$f":"IF($E2=\"SI\",VLOOKUP((CONCATENATE($A2,AF$1)),'Impactos Data'!$F$2:$G$521,2,FALSE),0)","v":0},{"$f":"IF($E2=\"SI\",VLOOKUP((CONCATENATE($A2,AG$1)),'Impactos Data'!$F$2:$G$521,2,FALSE),0)","v":0},{"$f":"IF($E2=\"SI\",VLOOKUP((CONCATENATE($A2,AH$1)),'Impactos Data'!$F$2:$G$521,2,FALSE),0)","v":0},{"$f":"IF($E2=\"SI\",VLOOKUP((CONCATENATE($A2,AI$1)),'Impactos Data'!$F$2:$G$521,2,FALSE),0)","v":0},{"$f":"IF($E2=\"SI\",VLOOKUP((CONCATENATE($A2,AJ$1)),'Impactos Data'!$F$2:$G$521,2,FALSE),0)","v":0},{"$f":"IF($E2=\"SI\",VLOOKUP((CONCATENATE($A2,AK$1)),'Impactos Data'!$F$2:$G$521,2,FALSE),0)","v":0},{"$f":"IF($E2=\"SI\",VLOOKUP((CONCATENATE($A2,AL$1)),'Impactos Data'!$F$2:$G$521,2,FALSE),0)","v":0},{"$f":"IF($E2=\"SI\",VLOOKUP((CONCATENATE($A2,AM$1)),'Impactos Data'!$F$2:$G$521,2,FALSE),0)","v":0},{"$f":"IF($E2=\"SI\",VLOOKUP((CONCATENATE($A2,AN$1)),'Impactos Data'!$F$2:$G$521,2,FALSE),0)","v":0},{"$f":"IF($E2=\"SI\",VLOOKUP((CONCATENATE($A2,AO$1)),'Impactos Data'!$F$2:$G$521,2,FALSE),0)","v":0},{"$f":"IF($E2=\"SI\",VLOOKUP((CONCATENATE($A2,AP$1)),'Impactos Data'!$F$2:$G$521,2,FALSE),0)","v":0},{"$f":"IF($E2=\"SI\",VLOOKUP((CONCATENATE($A2,AQ$1)),'Impactos Data'!$F$2:$G$521,2,FALSE),0)","v":0},{"$f":"IF($E2=\"SI\",VLOOKUP((CONCATENATE($A2,AR$1)),'Impactos Data'!$F$2:$G$521,2,FALSE),0)","v":0},{"$f":"IF($E2=\"SI\",VLOOKUP((CONCATENATE($A2,AS$1)),'Impactos Data'!$F$2:$G$521,2,FALSE),0)","v":0},{"$f":"IF($E2=\"SI\",VLOOKUP((CONCATENATE($A2,AT$1)),'Impactos Data'!$F$2:$G$521,2,FALSE),0)","v":0},{"$f":"IF($E2=\"SI\",VLOOKUP((CONCATENATE($A2,AU$1)),'Impactos Data'!$F$2:$G$521,2,FALSE),0)","v":0},{"$f":"SUM(AB2:AU2)","v":0},null,null,null,{"$f":"AB2*$V2","v":0},{"$f":"AC2*$V2","v":0},0,0,0,0,0,0,0,0,0,0,0,0,0,0,0,0,0,0,{"$f":"SUM(AZ2:BS2)","v":0}]
["CMO2",{"$f":"Movilidad!C3","v":"CICLOVÍAS"},{"$f":"'2c. Componentes Movilidad'!R46","v":0},{"$f":"Movilidad!C6","v":"¿El proyecto incluye cicovías?"},"NO",{"$f":"IF(E3=\"NO\",0,1)","v":0},{"$f":"Movilidad!C7","v":"¿Disuade el uso del automóvil?"},{"$f":"'2c. Componentes Movilidad'!V49","v":0},{"$f":"Movilidad!C8","v":"¿Hay tiendas y negocios alrededor?"},{"$f":"'2c. Componentes Movilidad'!V52","v":0},{"$f":"Movilidad!C9","v":"¿Incluye arbolado?"},{"$f":"'2c. Componentes Movilidad'!V55","v":0},{"$f":"Movilidad!C10","v":"¿Cuántos metros lineales de ciclovías?"},{"$f":"'2c. Componentes Movilidad'!V58","v":0},null,null,null,null,null,null,null,1,null,null,null,null,null,{"$f":"IF($E3=\"SI\",VLOOKUP((CONCATENATE($A3,AB$1)),'Impactos Data'!$F$2:$G$521,2,FALSE),0)","v":0},{"$f":"IF($E3=\"SI\",VLOOKUP((CONCATENATE($A3,AC$1)),'Impactos Data'!$F$2:$G$521,2,FALSE),0)","v":0},{"$f":"IF($E3=\"SI\",VLOOKUP((CONCATENATE($A3,AD$1)),'Impactos Data'!$F$2:$G$521,2,FALSE),0)","v":0},{"$f":"IF($E3=\"SI\",VLOOKUP((CONCATENATE($A3,AE$1)),'Impactos Data'!$F$2:$G$521,2,FALSE),0)","v":0},{"$f":"IF($E3=\"SI\",VLOOKUP((CONCATENATE($A3,AF$1)),'Impactos Data'!$F$2:$G$521,2,FALSE),0)","v":0},{"$f":"IF($E3=\"SI\",VLOOKUP((CONCATENATE($A3,AG$1)),'Impactos Data'!$F$2:$G$521,2,FALSE),0)","v":0},{"$f":"IF($E3=\"SI\",VLOOKUP((CONCATENATE($A3,AH$1)),'Impactos Data'!$F$2:$G$521,2,FALSE),0)","v":0},{"$f":"IF($E3=\"SI\",VLOOKUP((CONCATENATE($A3,AI$1)),'Impactos Data'!$F$2:$G$521,2,FALSE),0)","v":0},{"$f":"IF($E3=\"SI\",VLOOKUP((CONCATENATE($A3,AJ$1)),'Impactos Data'!$F$2:$G$521,2,FALSE),0)","v":0},{"$f":"IF($E3=\"SI\",VLOOKUP((CONCATENATE($A3,AK$1)),'Impactos Data'!$F$2:$G$521,2,FALSE),0)","v":0},{"$f":"IF($E3=\"SI\",VLOOKUP((CONCATENATE($A3,AL$1)),'Impactos Data'!$F$2:$G$521,2,FALSE),0)","v":0},{"$f":"IF($E3=\"SI\",VLOOKUP((CONCATENATE($A3,AM$1)),'Impactos Data'!$F$2:$G$521,2,FALSE),0)","v":0},{"$f":"IF($E3=\"SI\",VLOOKUP((CONCATENATE($A3,AN$1)),'Impactos Data'!$F$2:$G$521,2,FALSE),0)","v":0},{"$f":"IF($E3=\"SI\",VLOOKUP((CONCATENATE($A3,AO$1)),'Impactos Data'!$F$2:$G$521,2,FALSE),0)","v":0},{"$f":"IF($E3=\"SI\",VLOOKUP((CONCATENATE($A3,AP$1)),'Impactos Data'!$F$2:$G$521,2,FALSE),0)","v":0},{"$f":"IF($E3=\"SI\",VLOOKUP((CONCATENATE($A3,AQ$1)),'Impactos Data'!$F$2:$G$521,2,FALSE),0)","v":0},{"$f":"IF($E3=\"SI\",VLOOKUP((CONCATENATE($A3,AR$1)),'Impactos Data'!$F$2:$G$521,2,FALSE),0)","v":0},{"$f":"IF($E3=\"SI\",VLOOKUP((CONCATENATE($A3,AS$1)),'Impactos Data'!$F$2:$G$521,2,FALSE),0)","v":0},{"$f":"IF($E3=\"SI\",VLOOKUP((CONCATENATE($A3,AT$1)),'Impactos Data'!$F$2:$G$521,2,FALSE),0)","v":0},{"$f":"IF($E3=\"SI\",VLOOKUP((CONCATENATE($A3,AU$1)),'Impactos Data'!$F$2:$G$521,2,FALSE),0)","v":0},{"$f":"SUM(AB3:AU3)","v":0},null,null,null,{"$f":"AB3*$V3","v":0},0,0,0,0,0,0,0,0,0,0,0,0,0,0,0,0,0,0,0,{"$f":"SUM(AZ3:BS3)","v":0}]
["CMO3",{"$f":"Movilidad!D3","v":"CORREDOR PEATONAL "},{"$f":"'2c. Componentes Movilidad'!R65","v":0},{"$f":"Movilidad!D6","v":"¿En el proyecto dispone de algún corredor peatonal?"},"NO",0,{"$f":"Movilidad!D7","v":"¿Genera diferentes usos recreativos o deportivos?"},{"$f":"'2c. Componentes Movilidad'!V68","v":0},{"$f":"Movilidad!D8","v":"¿Incluye vegetación o arbolado?"},{"$f":"'2c. Componentes Movilidad'!V71","v":0},null,null,null,null,null,null,null,null,null,{"$f":"Movilidad!D20","v":"¿El corredor implantado genera usos recreativos, \n        comerciales o deportivos?"},{"$f":"'2c. Componentes Movilidad'!V74","v":0},{"$f":"IF(U4=0,1,IF(U4=Movilidad!D21,Movilidad!D23,Movilidad!D24))","v":1},null,null,null,null,null,{"$f":"IF($E4=\"SI\",VLOOKUP((CONCATENATE($A4,AB$1)),'Impactos Data'!$F$2:$G$521,2,FALSE),0)","v":0},{"$f":"IF($E4=\"SI\",VLOOKUP((CONCATENATE($A4,AC$1)),'Impactos Data'!$F$2:$G$521,2,FALSE),0)","v":0},{"$f":"IF($E4=\"SI\",VLOOKUP((CONCATENATE($A4,AD$1)),'Impactos Data'!$F$2:$G$521,2,FALSE),0)","v":0},{"$f":"IF($E4=\"SI\",VLOOKUP((CONCATENATE($A4,AE$1)),'Impactos Data'!$F$2:$G$521,2,FALSE),0)","v":0},{"$f":"IF($E4=\"SI\",VLOOKUP((CONCATENATE($A4,AF$1)),'Impactos Data'!$F$2:$G$521,2,FALSE),0)","v":0},{"$f":"IF($E4=\"SI\",VLOOKUP((CONCATENATE($A4,AG$1)),'Impactos Data'!$F$2:$G$521,2,FALSE),0)","v":0},{"$f":"IF($E4=\"SI\",VLOOKUP((CONCATENATE($A4,AH$1)),'Impactos Data'!$F$2:$G$521,2,FALSE),0)","v":0},{"$f":"IF($E4=\"SI\",VLOOKUP((CONCATENATE($A4,AI$1)),'Impactos Data'!$F$2:$G$521,2,FALSE),0)","v":0},{"$f":"IF($E4=\"SI\",VLOOKUP((CONCATENATE($A4,AJ$1)),'Impactos Data'!$F$2:$G$521,2,FALSE),0)","v":0},{"$f":"IF($E4=\"SI\",VLOOKUP((CONCATENATE($A4,AK$1)),'Impactos Data'!$F$2:$G$521,2,FALSE),0)","v":0},{"$f":"IF($E4=\"SI\",VLOOKUP((CONCATENATE($A4,AL$1)),'Impactos Data'!$F$2:$G$521,2,FALSE),0)","v":0},{"$f":"IF($E4=\"SI\",VLOOKUP((CONCATENATE($A4,AM$1)),'Impactos Data'!$F$2:$G$521,2,FALSE),0)","v":0},{"$f":"IF($E4=\"SI\",VLOOKUP((CONCATENATE($A4,AN$1)),'Impactos Data'!$F$2:$G$521,2,FALSE),0)","v":0},{"$f":"IF($E4=\"SI\",VLOOKUP((CONCATENATE($A4,AO$1)),'Impactos Data'!$F$2:$G$521,2,FALSE),0)","v":0},{"$f":"IF($E4=\"SI\",VLOOKUP((CONCATENATE($A4,AP$1)),'Impactos Data'!$F$2:$G$521,2,FALSE),0)","v":0},{"$f":"IF($E4=\"SI\",VLOOKUP((CONCATENATE($A4,AQ$1)),'Impactos Data'!$F$2:$G$521,2,FALSE),0)","v":0},{"$f":"IF($E4=\"SI\",VLOOKUP((CONCATENATE($A4,AR$1)),'Impactos Data'!$F$2:$G$521,2,FALSE),0)","v":0},{"$f":"IF($E4=\"SI\",VLOOKUP((CONCATENATE($A4,AS$1)),'Impactos Data'!$F$2:$G$521,2,FALSE),0)","v":0},{"$f":"IF($E4=\"SI\",VLOOKUP((CONCATENATE($A4,AT$1)),'Impactos Data'!$F$2:$G$521,2,FALSE),0)","v":0},{"$f":"IF($E4=\"SI\",VLOOKUP((CONCATENATE($A4,AU$1)),'Impactos Data'!$F$2:$G$521,2,FALSE),0)","v":0},0,null,null,null,0,0,0,0,0,0,0,0,0,0,0,0,0,0,0,0,0,0,0,0,0]
["CMO4",{"$f":"Movilidad!E3","v":"BANQUETAS"},{"$f":"'2c. Componentes Movilidad'!R84","v":0},{"$f":"Movilidad!E6","v":"¿El proyecto propone la introducción o ampliación de las banquetas?"},"NO",0,{"$f":"Movilidad!E7","v":"¿Cuál es el ancho (superficie aprox) de la introducción o \n       ampliación de banqueta?"},{"$f":"'2c. Componentes Movilidad'!V87","v":0},{"$f":"Movilidad!E8","v":"¿Cuenta con pavimento infiltrante, cuneta verde o jardinera?"},{"$f":"'2c. Componentes Movilidad'!V90","v":0},null,null,null,null,null,null,null,null,null,{"$f":"Movilidad!E20","v":"¿Cuál es el ancho (superficie aprox) de la introducción o ampliación de banqueta?"},{"$f":"'2c. Componentes Movilidad'!V87","v":0},{"$f":"IF(U5=0,1,IF(U5=Movilidad!E21,Movilidad!E24,IF(U5=Movilidad!E22,Movilidad!E25,Movilidad!E26)))","v":1},null,null,null,null,null,{"$f":"IF($E5=\"SI\",VLOOKUP((CONCATENATE($A5,AB$1)),'Impactos Data'!$F$2:$G$521,2,FALSE),0)","v":0},{"$f":"IF($E5=\"SI\",VLOOKUP((CONCATENATE($A5,AC$1)),'Impactos Data'!$F$2:$G$521,2,FALSE),0)","v":0},{"$f":"IF($E5=\"SI\",VLOOKUP((CONCATENATE($A5,AD$1)),'Impactos Data'!$F$2:$G$521,2,FALSE),0)","v":0},{"$f":"IF($E5=\"SI\",VLOOKUP((CONCATENATE($A5,AE$1)),'Impactos Data'!$F$2:$G$521,2,FALSE),0)","v":0},{"$f":"IF($E5=\"SI\",VLOOKUP((CONCATENATE($A5,AF$1)),'Impactos Data'!$F$2:$G$521,2,FALSE),0)","v":0},{"$f":"IF($E5=\"SI\",VLOOKUP((CONCATENATE($A5,AG$1)),'Impactos Data'!$F$2:$G$521,2,FALSE),0)","v":0},{"$f":"IF($E5=\"SI\",VLOOKUP((CONCATENATE($A5,AH$1)),'Impactos Data'!$F$2:$G$521,2,FALSE),0)","v":0},{"$f":"IF($E5=\"SI\",VLOOKUP((CONCATENATE($A5,AI$1)),'Impactos Data'!$F$2:$G$521,2,FALSE),0)","v":0},{"$f":"IF($E5=\"SI\",VLOOKUP((CONCATENATE($A5,AJ$1)),'Impactos Data'!$F$2:$G$521,2,FALSE),0)","v":0},{"$f":"IF($E5=\"SI\",VLOOKUP((CONCATENATE($A5,AK$1)),'Impactos Data'!$F$2:$G$521,2,FALSE),0)","v":0},{"$f":"IF($E5=\"SI\",VLOOKUP((CONCATENATE($A5,AL$1)),'Impactos Data'!$F$2:$G$521,2,FALSE),0)","v":0},{"$f":"IF($E5=\"SI\",VLOOKUP((CONCATENATE($A5,AM$1)),'Impactos Data'!$F$2:$G$521,2,FALSE),0)","v":0},{"$f":"IF($E5=\"SI\",VLOOKUP((CONCATENATE($A5,AN$1)),'Impactos Data'!$F$2:$G$521,2,FALSE),0)","v":0},{"$f":"IF($E5=\"SI\",VLOOKUP((CONCATENATE($A5,AO$1)),'Impactos Data'!$F$2:$G$521,2,FALSE),0)","v":0},{"$f":"IF($E5=\"SI\",VLOOKUP((CONCATENATE($A5,AP$1)),'Impactos Data'!$F$2:$G$521,2,FALSE),0)","v":0},{"$f":"IF($E5=\"SI\",VLOOKUP((CONCATENATE($A5,AQ$1)),'Impactos Data'!$F$2:$G$521,2,FALSE),0)","v":0},{"$f":"IF($E5=\"SI\",VLOOKUP((CONCATENATE($A5,AR$1)),'Impactos Data'!$F$2:$G$521,2,FALSE),0)","v":0},{"$f":"IF($E5=\"SI\",VLOOKUP((CONCATENATE($A5,AS$1)),'Impactos Data'!$F$2:$G$521,2,FALSE),0)","v":0},{"$f":"IF($E5=\"SI\",VLOOKUP((CONCATENATE($A5,AT$1)),'Impactos Data'!$F$2:$G$521,2,FALSE),0)","v":0},{"$f":"IF($E5=\"SI\",VLOOKUP((CONCATENATE($A5,AU$1)),'Impactos Data'!$F$2:$G$521,2,FALSE),0)","v":0},0,null,null,null,0,0,0,0,0,0,0,0,0,0,0,0,0,0,0,0,0,0,0,0,0]
["CMO5",{"$f":"Movilidad!F3","v":"ZONA TRANSPORTE PÚBLICO"},{"$f":"'2c. Componentes Movilidad'!R101","v":0},{"$f":"Movilidad!F6","v":"¿El proyecto incluye zonas de transporte público?"},"NO",0,{"$f":"Movilidad!F7","v":"metros lineales de carril transporte público"},{"$f":"'2c. Componentes Movilidad'!V104","v":0},null,null,null,null,null,null,null,null,null,null,null,null,null,1,null,null,null,null,null,{"$f":"IF($E6=\"SI\",VLOOKUP((CONCATENATE($A6,AB$1)),'Impactos Data'!$F$2:$G$521,2,FALSE),0)","v":0},{"$f":"IF($E6=\"SI\",VLOOKUP((CONCATENATE($A6,AC$1)),'Impactos Data'!$F$2:$G$521,2,FALSE),0)","v":0},{"$f":"IF($E6=\"SI\",VLOOKUP((CONCATENATE($A6,AD$1)),'Impactos Data'!$F$2:$G$521,2,FALSE),0)","v":0},{"$f":"IF($E6=\"SI\",VLOOKUP((CONCATENATE($A6,AE$1)),'Impactos Data'!$F$2:$G$521,2,FALSE),0)","v":0},{"$f":"IF($E6=\"SI\",VLOOKUP((CONCATENATE($A6,AF$1)),'Impactos Data'!$F$2:$G$521,2,FALSE),0)","v":0},{"$f":"IF($E6=\"SI\",VLOOKUP((CONCATENATE($A6,AG$1)),'Impactos Data'!$F$2:$G$521,2,FALSE),0)","v":0},{"$f":"IF($E6=\"SI\",VLOOKUP((CONCATENATE($A6,AH$1)),'Impactos Data'!$F$2:$G$521,2,FALSE),0)","v":0},{"$f":"IF($E6=\"SI\",VLOOKUP((CONCATENATE($A6,AI$1)),'Impactos Data'!$F$2:$G$521,2,FALSE),0)","v":0},{"$f":"IF($E6=\"SI\",VLOOKUP((CONCATENATE($A6,AJ$1)),'Impactos Data'!$F$2:$G$521,2,FALSE),0)","v":0},{"$f":"IF($E6=\"SI\",VLOOKUP((CONCATENATE($A6,AK$1)),'Impactos Data'!$F$2:$G$521,2,FALSE),0)","v":0},{"$f":"IF($E6=\"SI\",VLOOKUP((CONCATENATE($A6,AL$1)),'Impactos Data'!$F$2:$G$521,2,FALSE),0)","v":0},{"$f":"IF($E6=\"SI\",VLOOKUP((CONCATENATE($A6,AM$1)),'Impactos Data'!$F$2:$G$521,2,FALSE),0)","v":0},{"$f":"IF($E6=\"SI\",VLOOKUP((CONCATENATE($A6,AN$1)),'Impactos Data'!$F$2:$G$521,2,FALSE),0)","v":0},{"$f":"IF($E6=\"SI\",VLOOKUP((CONCATENATE($A6,AO$1)),'Impactos Data'!$F$2:$G$521,2,FALSE),0)","v":0},{"$f":"IF($E6=\"SI\",VLOOKUP((CONCATENATE($A6,AP$1)),'Impactos Data'!$F$2:$G$521,2,FALSE),0)","v":0},{"$f":"IF($E6=\"SI\",VLOOKUP((CONCATENATE($A6,AQ$1)),'Impactos Data'!$F$2:$G$521,2,FALSE),0)","v":0},{"$f":"IF($E6=\"SI\",VLOOKUP((CONCATENATE($A6,AR$1)),'Impactos Data'!$F$2:$G$521,2,FALSE),0)","v":0},{"$f":"IF($E6=\"SI\",VLOOKUP((CONCATENATE($A6,AS$1)),'Impactos Data'!$F$2:$G$521,2,FALSE),0)","v":0},{"$f":"IF($E6=\"SI\",VLOOKUP((CONCATENATE($A6,AT$1)),'Impactos Data'!$F$2:$G$521,2,FALSE),0)","v":0},{"$f":"IF($E6=\"SI\",VLOOKUP((CONCATENATE($A6,AU$1)),'Impactos Data'!$F$2:$G$521,2,FALSE),0)","v":0},0,null,null,null,0,0,0,0,0,0,0,0,0,0,0,0,0,0,0,0,0,0,0,0,0]
["CMO6",{"$f":"Movilidad!G3","v":"ZONA CARGA SOSTENIBLE"},{"$f":"'2c. Componentes Movilidad'!R117","v":0},{"$f":"Movilidad!G6","v":"¿El proyecto incluye zona de carga y descarga sostenible?"},"NO",0,{"$f":"Movilidad!G7","v":"metros lineales de carril para carga/descarga "},{"$f":"'2c. Componentes Movilidad'!V120","v":0},null,null,null,null,null,null,null,null,null,null,null,null,null,1,null,null,null,null,null,{"$f":"IF($E7=\"SI\",VLOOKUP((CONCATENATE($A7,AB$1)),'Impactos Data'!$F$2:$G$521,2,FALSE),0)","v":0},{"$f":"IF($E7=\"SI\",VLOOKUP((CONCATENATE($A7,AC$1)),'Impactos Data'!$F$2:$G$521,2,FALSE),0)","v":0},{"$f":"IF($E7=\"SI\",VLOOKUP((CONCATENATE($A7,AD$1)),'Impactos Data'!$F$2:$G$521,2,FALSE),0)","v":0},{"$f":"IF($E7=\"SI\",VLOOKUP((CONCATENATE($A7,AE$1)),'Impactos Data'!$F$2:$G$521,2,FALSE),0)","v":0},{"$f":"IF($E7=\"SI\",VLOOKUP((CONCATENATE($A7,AF$1)),'Impactos Data'!$F$2:$G$521,2,FALSE),0)","v":0},{"$f":"IF($E7=\"SI\",VLOOKUP((CONCATENATE($A7,AG$1)),'Impactos Data'!$F$2:$G$521,2,FALSE),0)","v":0},{"$f":"IF($E7=\"SI\",VLOOKUP((CONCATENATE($A7,AH$1)),'Impactos Data'!$F$2:$G$521,2,FALSE),0)","v":0},{"$f":"IF($E7=\"SI\",VLOOKUP((CONCATENATE($A7,AI$1)),'Impactos Data'!$F$2:$G$521,2,FALSE),0)","v":0},{"$f":"IF($E7=\"SI\",VLOOKUP((CONCATENATE($A7,AJ$1)),'Impactos Data'!$F$2:$G$521,2,FALSE),0)","v":0},{"$f":"IF($E7=\"SI\",VLOOKUP((CONCATENATE($A7,AK$1)),'Impactos Data'!$F$2:$G$521,2,FALSE),0)","v":0},{"$f":"IF($E7=\"SI\",VLOOKUP((CONCATENATE($A7,AL$1)),'Impactos Data'!$F$2:$G$521,2,FALSE),0)","v":0},{"$f":"IF($E7=\"SI\",VLOOKUP((CONCATENATE($A7,AM$1)),'Impactos Data'!$F$2:$G$521,2,FALSE),0)","v":0},{"$f":"IF($E7=\"SI\",VLOOKUP((CONCATENATE($A7,AN$1)),'Impactos Data'!$F$2:$G$521,2,FALSE),0)","v":0},{"$f":"IF($E7=\"SI\",VLOOKUP((CONCATENATE($A7,AO$1)),'Impactos Data'!$F$2:$G$521,2,FALSE),0)","v":0},{"$f":"IF($E7=\"SI\",VLOOKUP((CONCATENATE($A7,AP$1)),'Impactos Data'!$F$2:$G$521,2,FALSE),0)","v":0},{"$f":"IF($E7=\"SI\",VLOOKUP((CONCATENATE($A7,AQ$1)),'Impactos Data'!$F$2:$G$521,2,FALSE),0)","v":0},{"$f":"IF($E7=\"SI\",VLOOKUP((CONCATENATE($A7,AR$1)),'Impactos Data'!$F$2:$G$521,2,FALSE),0)","v":0},{"$f":"IF($E7=\"SI\",VLOOKUP((CONCATENATE($A7,AS$1)),'Impactos Data'!$F$2:$G$521,2,FALSE),0)","v":0},{"$f":"IF($E7=\"SI\",VLOOKUP((CONCATENATE($A7,AT$1)),'Impactos Data'!$F$2:$G$521,2,FALSE),0)","v":0},{"$f":"IF($E7=\"SI\",VLOOKUP((CONCATENATE($A7,AU$1)),'Impactos Data'!$F$2:$G$521,2,FALSE),0)","v":0},0,null,null,null,0,0,0,0,0,0,0,0,0,0,0,0,0,0,0,0,0,0,0,0,0]
["CMO7",{"$f":"Movilidad!H3","v":"ZONA VEHÍCULO PRIVADO SOSTENIBLE"},{"$f":"'2c. Componentes Movilidad'!R133","v":0},{"$f":"Movilidad!H6","v":"¿El proyecto incluye zona de vehículo privado sostenible?"},"NO",{"$f":"IF(E8=\"NO\",0,1)","v":0},{"$f":"Movilidad!H7","v":"metros lineales de carril para vehículo sostenible "},{"$f":"'2c. Componentes Movilidad'!V136","v":0},null,null,null,null,null,null,null,null,null,null,null,null,null,1,null,null,null,null,null,{"$f":"IF($E8=\"SI\",VLOOKUP((CONCATENATE($A8,AB$1)),'Impactos Data'!$F$2:$G$521,2,FALSE),0)","v":0},{"$f":"IF($E8=\"SI\",VLOOKUP((CONCATENATE($A8,AC$1)),'Impactos Data'!$F$2:$G$521,2,FALSE),0)","v":0},{"$f":"IF($E8=\"SI\",VLOOKUP((CONCATENATE($A8,AD$1)),'Impactos Data'!$F$2:$G$521,2,FALSE),0)","v":0},{"$f":"IF($E8=\"SI\",VLOOKUP((CONCATENATE($A8,AE$1)),'Impactos Data'!$F$2:$G$521,2,FALSE),0)","v":0},{"$f":"IF($E8=\"SI\",VLOOKUP((CONCATENATE($A8,AF$1)),'Impactos Data'!$F$2:$G$521,2,FALSE),0)","v":0},{"$f":"IF($E8=\"SI\",VLOOKUP((CONCATENATE($A8,AG$1)),'Impactos Data'!$F$2:$G$521,2,FALSE),0)","v":0},{"$f":"IF($E8=\"SI\",VLOOKUP((CONCATENATE($A8,AH$1)),'Impactos Data'!$F$2:$G$521,2,FALSE),0)","v":0},{"$f":"IF($E8=\"SI\",VLOOKUP((CONCATENATE($A8,AI$1)),'Impactos Data'!$F$2:$G$521,2,FALSE),0)","v":0},{"$f":"IF($E8=\"SI\",VLOOKUP((CONCATENATE($A8,AJ$1)),'Impactos Data'!$F$2:$G$521,2,FALSE),0)","v":0},{"$f":"IF($E8=\"SI\",VLOOKUP((CONCATENATE($A8,AK$1)),'Impactos Data'!$F$2:$G$521,2,FALSE),0)","v":0},{"$f":"IF($E8=\"SI\",VLOOKUP((CONCATENATE($A8,AL$1)),'Impactos Data'!$F$2:$G$521,2,FALSE),0)","v":0},{"$f":"IF($E8=\"SI\",VLOOKUP((CONCATENATE($A8,AM$1)),'Impactos Data'!$F$2:$G$521,2,FALSE),0)","v":0},{"$f":"IF($E8=\"SI\",VLOOKUP((CONCATENATE($A8,AN$1)),'Impactos Data'!$F$2:$G$521,2,FALSE),0)","v":0},{"$f":"IF($E8=\"SI\",VLOOKUP((CONCATENATE($A8,AO$1)),'Impactos Data'!$F$2:$G$521,2,FALSE),0)","v":0},{"$f":"IF($E8=\"SI\",VLOOKUP((CONCATENATE($A8,AP$1)),'Impactos Data'!$F$2:$G$521,2,FALSE),0)","v":0},{"$f":"IF($E8=\"SI\",VLOOKUP((CONCATENATE($A8,AQ$1)),'Impactos Data'!$F$2:$G$521,2,FALSE),0)","v":0},{"$f":"IF($E8=\"SI\",VLOOKUP((CONCATENATE($A8,AR$1)),'Impactos Data'!$F$2:$G$521,2,FALSE),0)","v":0},{"$f":"IF($E8=\"SI\",VLOOKUP((CONCATENATE($A8,AS$1)),'Impactos Data'!$F$2:$G$521,2,FALSE),0)","v":0},{"$f":"IF($E8=\"SI\",VLOOKUP((CONCATENATE($A8,AT$1)),'Impactos Data'!$F$2:$G$521,2,FALSE),0)","v":0},{"$f":"IF($E8=\"SI\",VLOOKUP((CONCATENATE($A8,AU$1)),'Impactos Data'!$F$2:$G$521,2,FALSE),0)","v":0},0,null,null,null,0,0,0,0,0,0,0,0,0,0,0,0,0,0,0,0,0,0,0,0,0]
[]
[]
[]
[]
[]
[]
[]
[]
[]
[]
[null,null,null,null,null,null,null,null,null,null,null,null,null,null,null,null,null,null,null,null,null,null,null,null,null,null,null,{"$f":"AB1","v":1},{"$f":"AC1","v":2},3,4,5,6,7,8,9,10,11,12,13,14,15,16,17,18,19,20,null,null,null,null,{"$f":"AZ1","v":1},{"$f":"BA1","v":2},3,4,5,6,7,8,9,10,11,12,13,14,15,16,17,18,19,20]
[null,null,null,null,null,null,null,null,null,null,null,null,null,null,null,null,null,null,null,null,null,null,null,null,null,null,"SUMA",{"$f":"SUM(AB2:AB8)","v":0},{"$f":"SUM(AC2:AC8)","v":0},0,0,0,0,0,0,0,0,0,0,0,0,0,0,0,0,0,0,null,null,null,null,{"$f":"SUM(AZ2:AZ10)","v":0},{"$f":"SUM(BA2:BA10)","v":0},0,0,0,0,0,0,0,0,0,0,0,0,0,0,0,0,0,0]
[null,"SUM SI",{"$f":"SUMPRODUCT(C3:C19,F3:F19)","v":0},"COUNT SI",{"$f":"COUNTIF(E2:E18,\"SI\")","v":0}]

{"sheet":"2d Componentes Espacio Público","index":19,"n_rows":111,"n_cols":22,"rows_kept":111,"cut":false,"hidden":true,"merged":[[37,2,37,12],[3,5,3,6],[3,9,3,11],[8,1,10,12],[13,1,13,23],[22,1,24,12],[23,14,23,16],[23,17,23,19],[33,14,36,20],[33,21,34,21],[28,15,31,21],[26,14,27,20],[26,21,27,21],[26,2,36,12],[56,2,57,2],[56,3,57,12],[38,2,40,2],[38,3,40,12],[38,14,40,20],[43,1,45,12],[44,14,44,16],[44,17,44,19],[47,14,48,20],[47,2,55,12],[47,21,48,21],[48,13,56,13],[50,14,51,20],[50,21,51,21],[53,14,54,19],[55,14,55,20],[64,21,65,21],[65,13,73,13],[67,14,69,20],[67,21,68,21],[70,14,70,19],[71,14,72,20],[77,1,79,12],[78,14,78,16],[78,17,78,19],[81,14,82,20],[92,2,93,2],[106,21,107,21],[109,14,109,20],[110,2,111,2],[110,3,111,12],[96,1,98,12],[97,14,97,16],[97,17,97,19],[100,14,101,20],[100,21,101,21],[101,2,109,12],[101,13,110,13],[103,14,104,20],[103,21,104,21],[106,14,107,20],[1,1,1,21],[81,21,82,21],[82,13,92,13],[84,14,85,20],[84,21,85,21],[87,14,88,19],[90,14,91,20],[92,3,93,12],[60,1,62,12],[61,14,61,16],[61,17,61,19],[64,14,65,20],[73,2,74,2],[73,3,74,12],[64,2,72,12],[81,2,91,12]]}
[]
[null,"Herramienta para la estimación y evaluación de los impactos de la infraestructura verde"]
[]
[null,null,null,null,null,"1. Introducción ",null,null,null,"2. Preparar evaluación ",null,null,null,null,"3. Recolección de datos",null,null,null,null,"4. Impactos/Resultados"]
[]
[null,null,null,null,null,null,"2a. Componentes AGUA",null,null,null,"2b. Componentes BIODIVERSIDAD",null,null,null,null,"2c. Componentes MOVILIDAD",null,null,null,null,"2d. Componentes ESPACIO PUBLICO"]
[]
[null,"Acerca de esta pestaña:"]
[null,"Esta pestaña tiene la definición de los componentes de IV del eje de Espacio Público"]
[]
[]
[]
[]
[null,"2d. Selección de componentes de IV del eje ESPACIO PÚBLICO"]
[]
[]
[]
[]
[]
[]
[]
[]
[null,{"$f":"\"    \"&'Espacio Público'!B3","v":"    MOBILIARIO URBANO SOSTENIBLE"}]
[null,null,null,null,null,null,null,null,null,null,null,null,null,null,"Presupuesto asignado",null,null,0,null,null,null,{"$f":"'Espacio Público'!B2","v":"CEP1"}]
[]
[]
[null,null,{"$f":"'Espacio Público'!B4","v":"Se refiere al conjunto de instalaciones facilitadas por los ayuntamientos para la prestación de servicios urbanos  cuya función es la de equipar a la ciudad y el espacio público de elementos que permitan adecuado funcionamiento como bancas, botes de basura, marquesinas en paradas de autobuses, farolas, quioscos, sanitarios públicos, paneles luminosos, jardineras, señalización luminosa, etc. \n\nLa etiqueta sostenible se refiere al uso de materiales autóctonos o reciclados, uso de pinturas ecológicas, certificaciones, inclusión de dispositivos para la cosecha de agua, instalación de parquímetros, centros de recarga  y en general, criterios ambientales en la manufactura, fabricación y uso de este tipo de mobiliario en el espacio público."},null,null,null,null,null,null,null,null,null,null,null,{"$f":"\"       \"&'Espacio Público'!B7","v":"       ¿Qué mobiliario se utiliza?"}]
[]
[]
[]
[]
[]
[]
[null,null,null,null,null,null,null,null,null,null,null,null,null,null,{"$f":"\"       \"&'Espacio Público'!B14","v":"       ¿El mobiliario sostenible utilizado tiene algún certificado \n        ambiental, de ahorro de agua en su producción o uso, de \n        eficiencia energética o de uso de materiales reciclados \n        durante su manufactura?"}]
[]
[]
[]
[]
[null,null,{"$f":"IF(D39=0,\" \",\"Fuente:\")","v":"Fuente:"},{"$f":"'Espacio Público'!B5","v":"Comunidad de Madrid (s.f.) Guía de Mobiliario Urbano Sostenible con Eficiencia Energética. Consejería de Economía y Hacienda. Comunidad de Madrid. Madrid Solar. Madrid. 92p. Disponible en: http://www.madrid.org/bvirtual/BVCM005915.pdf. Última consulta: 23 de agosto de 2021"}]
[]
[]
[]
[]
[null,{"$f":"\"    \"&'Espacio Público'!C3","v":"    MOBILIARIO HIDRÁULICO CERTIFICADO"}]
[null,null,null,null,null,null,null,null,null,null,null,null,null,null,"Presupuesto asignado",null,null,0,null,null,null,{"$f":"'Espacio Público'!C2","v":"CEP2"}]
[]
[]
[null,null,{"$f":"'Espacio Público'!C4","v":"Se refiere a mobiliario cuyo sistema hidráulico permite la reutilización de las  las aguas grises, negras y lluvias, para usos de regadío o usos compatibles. \n\nPermite la renovación y depurado utilizando 4 componentes; trampa para grasa, tanque séptico, zanja de arena filtrante y pozo de absorción."},null,null,null,null,null,null,null,null,null,null,null,{"$f":"\"       \"&'Espacio Público'!C7","v":"       m3 de agua reciclados (m3 /día)"}]
[]
[]
[null,null,null,null,null,null,null,null,null,null,null,null,null,null,{"$f":"\"       \"&'Espacio Público'!C8","v":"       ¿Qué porcentaje de abastecimiento de agua para regadío \n        proporciona? "}]
[]
[]
[]
[]
[]
[null,null,{"$f":"IF(D57=0,\" \",\"Fuente:\")","v":" "},{"$f":"'Espacio Público'!C5","v":0}]
[]
[]
[]
[null,{"$f":"\"    \" &'Espacio Público'!D3","v":"    LUMINARIAS SUSTENTABLES"}]
[null,null,null,null,null,null,null,null,null,null,null,null,null,null,"Presupuesto asignado",null,null,0,null,null,null,{"$f":"'Espacio Público'!D2","v":"CEP3"}]
[]
[]
[null,null,{"$f":"'Espacio Público'!D4","v":"Se refiere a las lámparas de alumbrado público o utilizadas al interior de los proyectos, cuya fuente energética proviene de fuentes sustentables, tales como paneles fotovoltaícos, energía eólica, etc."},null,null,null,null,null,null,null,null,null,null,null,{"$f":"\"      \"&'Espacio Público'!D7","v":"      ¿Cuántas luminarias fueron en total  instaladas?"}]
[]
[]
[null,null,null,null,null,null,null,null,null,null,null,null,null,null,{"$f":"\"      \"&'Espacio Público'!D14","v":"      ¿Las luminarias disponen algún sistema dentro del proyecto \n       que produzca su propia fuente energética? (fotovoltaico, \n       etc.)"}]
[]
[]
[]
[]
[]
[null,null,{"$f":"IF(D74=0,\" \",\"Fuente:\")","v":" "},{"$f":"'Espacio Público'!D5","v":0}]
[]
[]
[]
[null,{"$f":"\"    \"&'Espacio Público'!E3","v":"    PAVIMENTOS RECICLADOS"}]
[null,null,null,null,null,null,null,null,null,null,null,null,null,null,"Presupuesto asignado",null,null,0,null,null,null,{"$f":"'Espacio Público'!E2","v":"CEP4"}]
[]
[]
[null,null,{"$f":"'Espacio Público'!E4","v":"Se entiende como reciclado de pavimentos, la reutilización de los materiales procedentes de la demolición de las capas de firmes que ya han estado en servicio, en la construcción de otras nuevas. \n\nEl reciclado de pavimentos asfálticos se realiza sobre materiales deteriorados que han perdido en gran medida sus propiedades iniciales, aunque en casos muy especiales puede actuarse también sobre materiales en condiciones de servicio para mejorar sus características. "},null,null,null,null,null,null,null,null,null,null,null,{"$f":"\"      \"&'Espacio Público'!E7","v":"      ¿Qué porcentaje del suelo ocupa?"},null,null,null,null,null,null,"<50%"]
[]
[]
[null,null,null,null,null,null,null,null,null,null,null,null,null,null,{"$f":"\"      \"&'Espacio Público'!E11","v":"      ¿El pavimento utilizado permite la infiltración del agua?"}]
[]
[]
[]
[]
[]
[]
[]
[null,null,{"$f":"IF(D93=0,\" \",\"Fuente:\")","v":"Fuente:"},{"$f":"'Espacio Público'!E5","v":"http://www.cedex.es/NR/rdonlyres/26C518BE-1802-4803-82B1-FBE634B03B03/119932/RECICLADODEPAVIMENTOSASFALTICOS.pdf. Última consulta: 8 de septiembre de 2021."}]
[]
[]
[]
[null,{"$f":"\"   \"&'Espacio Público'!F3","v":"   ELEMENTOS DE SOMBREAMIENTO"}]
[null,null,null,null,null,null,null,null,null,null,null,null,null,null,"Presupuesto asignado",null,null,0,null,null,null,{"$f":"'Espacio Público'!F2","v":"CEP5"}]
[]
[]
[null,null,null,null,null,null,null,null,null,null,null,null,null,null,{"$f":"\"      \"&'Espacio Público'!F7","v":"      ¿Producen sombra en la orientación sur?"}]
[null,null,{"$f":"'Espacio Público'!F4","v":"Se refiere a los elementos de diseño o estructuras en el espacio a analizar  cuyo objetivo sea la proporcionar sombra (aleros, pérgolas, marquesinas, etc.)\n\n*No se incluye nada de arbolado urbano. Son únicamente son elementos artificiales de sonbreamiento."}]
[]
[null,null,null,null,null,null,null,null,null,null,null,null,null,null,{"$f":"\"      \"&'Espacio Público'!F10","v":"      Respecto al total de m2 del espacio abierto del proyecto, \n        ¿qué superficie ocupan?"}]
[]
[]
[null,null,null,null,null,null,null,null,null,null,null,null,null,null,{"$f":"\"      \"&'Espacio Público'!F14","v":"      ¿Incorpora plantas trepadoras o enredaderas de sombra?"}]
[]
[]
[]
[null,null,{"$f":"IF(D111=0,\" \",\"Fuente:\")","v":"Fuente:"},{"$f":"'Espacio Público'!F5","v":"International Journal of Design &Nature and Ecodynamics. Vol 15, Nº1, February, 2020, pp33-38. Urban Regreeneration: Green Urban Infrastructure as a Response to Climate Change Mitigation and Adaptation by Jon Laurenz Senosiain"}]

{"sheet":"Espacio Público","index":20,"n_rows":18,"n_cols":6,"rows_kept":18,"cut":false,"hidden":true,"merged":[]}
["Eje","Espacio Público","Espacio Público","Espacio Público","Espacio Público","Espacio Público"]
["Código","CEP1","CEP2","CEP3","CEP4","CEP5"]
["Componentes","MOBILIARIO URBANO SOSTENIBLE","MOBILIARIO HIDRÁULICO CERTIFICADO","LUMINARIAS SUSTENTABLES","PAVIMENTOS RECICLADOS","ELEMENTOS DE SOMBREAMIENTO"]
["Descripción","Se refiere al conjunto de instalaciones facilitadas por los ayuntamientos para la prestación de servicios urbanos  cuya función es la de equipar a la ciudad y el espacio público de elementos que permitan adecuado funcionamiento como bancas, botes de basura, marquesinas en paradas de autobuses, farolas, quioscos, sanitarios públicos, paneles luminosos, jardineras, señalización luminosa, etc. \n\nLa etiqueta sostenible se refiere al uso de materiales autóctonos o reciclados, uso de pinturas ecológicas, certificaciones, inclusión de dispositivos para la cosecha de agua, instalación de parquímetros, centros de recarga  y en general, criterios ambientales en la manufactura, fabricación y uso de este tipo de mobiliario en el espacio público.","Se refiere a mobiliario cuyo sistema hidráulico permite la reutilización de las  las aguas grises, negras y lluvias, para usos de regadío o usos compatibles. \n\nPermite la renovación y depurado utilizando 4 componentes; trampa para grasa, tanque séptico, zanja de arena filtrante y pozo de absorción.","Se refiere a las lámparas de alumbrado público o utilizadas al interior de los proyectos, cuya fuente energética proviene de fuentes sustentables, tales como paneles fotovoltaícos, energía eólica, etc.","Se entiende como reciclado de pavimentos, la reutilización de los materiales procedentes de la demolición de las capas de firmes que ya han estado en servicio, en la construcción de otras nuevas. \n\nEl reciclado de pavimentos asfálticos se realiza sobre materiales deteriorados que han perdido en gran medida sus propiedades iniciales, aunque en casos muy especiales puede actuarse también sobre materiales en condiciones de servicio para mejorar sus características. ","Se refiere a los elementos de diseño o estructuras en el espacio a analizar  cuyo objetivo sea la proporcionar sombra (aleros, pérgolas, marquesinas, etc.)\n\n*No se incluye nada de arbolado urbano. Son únicamente son elementos artificiales de sonbreamiento."]
["Referencia","Comunidad de Madrid (s.f.) Guía de Mobiliario Urbano Sostenible con Eficiencia Energética. Consejería de Economía y Hacienda. Comunidad de Madrid. Madrid Solar. Madrid. 92p. Disponible en: http://www.madrid.org/bvirtual/BVCM005915.pdf. Última consulta: 23 de agosto de 2021",null,null,"http://www.cedex.es/NR/rdonlyres/26C518BE-1802-4803-82B1-FBE634B03B03/119932/RECICLADODEPAVIMENTOSASFALTICOS.pdf. Última consulta: 8 de septiembre de 2021.","International Journal of Design &Nature and Ecodynamics. Vol 15, Nº1, February, 2020, pp33-38. Urban Regreeneration: Green Urban Infrastructure as a Response to Climate Change Mitigation and Adaptation by Jon Laurenz Senosiain"]
["Pregunta 1","¿En el proyecto se utiliza mobiliario urbano sostenible?","¿En el proyecto se utiliza mobiliario hidraulico certificado?","¿En el proyecto se utiliza luminarias sustentables?","¿En el proyecto se utilizan pavimentos reciclados?","¿En el proyecto se utilizan elementos de sombreamiento?"]
["Pregunta 1a","¿Qué mobiliario se utiliza?","m3 de agua reciclados (m3 /día)","¿Cuántas luminarias fueron en total  instaladas?","¿Qué porcentaje del suelo ocupa?","¿Producen sombra en la orientación sur?"]
[null,null,"¿Qué porcentaje de abastecimiento de agua para regadío \n        proporciona? ",null,"<50%","SI"]
[null,null,"<50%",null,"51% - 99%,","NO"]
[null,null,"51% - 99%,",null,1,"Respecto al total de m2 del espacio abierto del proyecto, \n        ¿qué superficie ocupan?"]
[null,null,1,null,"¿El pavimento utilizado permite la infiltración del agua?","<20%"]
[null,null,null,null,"SI","21% - 49%"]
[null,null,null,null,"NO",">50%"]
["Pregunta Q1","¿El mobiliario sostenible utilizado tiene algún certificado \n        ambiental, de ahorro de agua en su producción o uso, de \n        eficiencia energética o de uso de materiales reciclados \n        durante su manufactura?",null,"¿Las luminarias disponen algún sistema dentro del proyecto \n       que produzca su propia fuente energética? (fotovoltaico, \n       etc.)",null,"¿Incorpora plantas trepadoras o enredaderas de sombra?"]
["RQ1","SI",null,"SI",null,"SI"]
["RQ2","NO",null,"NO",null,"NO"]
["QSI",1,null,1,null,1]
["QNO",0.5,null,0.5,null,0.5]

{"sheet":"RegistroP","index":21,"n_rows":21,"n_cols":72,"rows_kept":21,"cut":false,"hidden":true,"merged":[]}
["Código","Componentes","Presupuesto","Pregunta 1","Respuesta","Valor ","Pregunta 1SI","Dato 1","Pregunta 2SI","Dato 2","Pregunta 3SI","Dato 3","Pregunta 4SI","Dato 4","Pregunta 5SI","Dato 5","Pregunta 6SI","Dato 6","PreguntaDato1SI",null,null,"Pregunta clave","Dato Q","Dato q1",null,null,null,1,2,3,4,5,6,7,8,9,10,11,12,13,14,15,16,17,18,19,20,"Suma componente",null,null,null,1,2,3,4,5,6,7,8,9,10,11,12,13,14,15,16,17,18,19,20,"Suma"]
["CEP1",{"$f":"'Espacio Público'!B3","v":"MOBILIARIO URBANO SOSTENIBLE"},{"$f":"'2d Componentes Espacio Público'!S24","v":0},{"$f":"'Espacio Público'!B6","v":"¿En el proyecto se utiliza mobiliario urbano sostenible?"},"NO",{"$f":"IF(E2=\"NO\",0,1)","v":0},{"$f":"'Espacio Público'!B7","v":"¿Qué mobiliario se utiliza?"},{"$f":"'2d Componentes Espacio Público'!P29","v":0},null,null,null,null,null,null,null,null,null,null,null,null,null,{"$f":"'Espacio Público'!B14","v":"¿El mobiliario sostenible utilizado tiene algún certificado \n        ambiental, de ahorro de agua en su producción o uso, de \n        eficiencia energética o de uso de materiales reciclados \n        durante su manufactura?"},{"$f":"'2d Componentes Espacio Público'!V34","v":0},{"$f":"IF(W2=0,1,IF(W2='Espacio Público'!B15,'Espacio Público'!B17,'Espacio Público'!B18))","v":1},null,null,null,{"$f":"IF($E2=\"SI\",VLOOKUP((CONCATENATE($A2,AB$1)),'Impactos Data'!$F$2:$G$521,2,FALSE),0)","v":0},{"$f":"IF($E2=\"SI\",VLOOKUP((CONCATENATE($A2,AC$1)),'Impactos Data'!$F$2:$G$521,2,FALSE),0)","v":0},{"$f":"IF($E2=\"SI\",VLOOKUP((CONCATENATE($A2,AD$1)),'Impactos Data'!$F$2:$G$521,2,FALSE),0)","v":0},{"$f":"IF($E2=\"SI\",VLOOKUP((CONCATENATE($A2,AE$1)),'Impactos Data'!$F$2:$G$521,2,FALSE),0)","v":0},{"$f":"IF($E2=\"SI\",VLOOKUP((CONCATENATE($A2,AF$1)),'Impactos Data'!$F$2:$G$521,2,FALSE),0)","v":0},{"$f":"IF($E2=\"SI\",VLOOKUP((CONCATENATE($A2,AG$1)),'Impactos Data'!$F$2:$G$521,2,FALSE),0)","v":0},{"$f":"IF($E2=\"SI\",VLOOKUP((CONCATENATE($A2,AH$1)),'Impactos Data'!$F$2:$G$521,2,FALSE),0)","v":0},{"$f":"IF($E2=\"SI\",VLOOKUP((CONCATENATE($A2,AI$1)),'Impactos Data'!$F$2:$G$521,2,FALSE),0)","v":0},{"$f":"IF($E2=\"SI\",VLOOKUP((CONCATENATE($A2,AJ$1)),'Impactos Data'!$F$2:$G$521,2,FALSE),0)","v":0},{"$f":"IF($E2=\"SI\",VLOOKUP((CONCATENATE($A2,AK$1)),'Impactos Data'!$F$2:$G$521,2,FALSE),0)","v":0},{"$f":"IF($E2=\"SI\",VLOOKUP((CONCATENATE($A2,AL$1)),'Impactos Data'!$F$2:$G$521,2,FALSE),0)","v":0},{"$f":"IF($E2=\"SI\",VLOOKUP((CONCATENATE($A2,AM$1)),'Impactos Data'!$F$2:$G$521,2,FALSE),0)","v":0},{"$f":"IF($E2=\"SI\",VLOOKUP((CONCATENATE($A2,AN$1)),'Impactos Data'!$F$2:$G$521,2,FALSE),0)","v":0},{"$f":"IF($E2=\"SI\",VLOOKUP((CONCATENATE($A2,AO$1)),'Impactos Data'!$F$2:$G$521,2,FALSE),0)","v":0},{"$f":"IF($E2=\"SI\",VLOOKUP((CONCATENATE($A2,AP$1)),'Impactos Data'!$F$2:$G$521,2,FALSE),0)","v":0},{"$f":"IF($E2=\"SI\",VLOOKUP((CONCATENATE($A2,AQ$1)),'Impactos Data'!$F$2:$G$521,2,FALSE),0)","v":0},{"$f":"IF($E2=\"SI\",VLOOKUP((CONCATENATE($A2,AR$1)),'Impactos Data'!$F$2:$G$521,2,FALSE),0)","v":0},{"$f":"IF($E2=\"SI\",VLOOKUP((CONCATENATE($A2,AS$1)),'Impactos Data'!$F$2:$G$521,2,FALSE),0)","v":0},{"$f":"IF($E2=\"SI\",VLOOKUP((CONCATENATE($A2,AT$1)),'Impactos Data'!$F$2:$G$521,2,FALSE),0)","v":0},{"$f":"IF($E2=\"SI\",VLOOKUP((CONCATENATE($A2,AU$1)),'Impactos Data'!$F$2:$G$521,2,FALSE),0)","v":0},{"$f":"SUM(AB2:AU2)","v":0},null,null,null,{"$f":"AB2*$X2","v":0},{"$f":"AC2*$X2","v":0},0,0,0,0,0,0,0,0,0,0,0,0,0,0,0,0,0,0,{"$f":"SUM(AZ2:BS2)","v":0}]
["CEP2",{"$f":"'Espacio Público'!C3","v":"MOBILIARIO HIDRÁULICO CERTIFICADO"},{"$f":"'2d Componentes Espacio Público'!S45","v":0},{"$f":"'Espacio Público'!C6","v":"¿En el proyecto se utiliza mobiliario hidraulico certificado?"},"NO",{"$f":"IF(E3=\"NO\",0,1)","v":0},{"$f":"'Espacio Público'!C7","v":"m3 de agua reciclados (m3 /día)"},{"$f":"'2d Componentes Espacio Público'!V48","v":0},{"$f":"'Espacio Público'!C8","v":"¿Qué porcentaje de abastecimiento de agua para regadío \n        proporciona? "},{"$f":"'2d Componentes Espacio Público'!V51","v":0},null,null,null,null,null,null,null,null,null,null,null,null,null,1,null,null,null,{"$f":"IF($E3=\"SI\",VLOOKUP((CONCATENATE($A3,AB$1)),'Impactos Data'!$F$2:$G$521,2,FALSE),0)","v":0},{"$f":"IF($E3=\"SI\",VLOOKUP((CONCATENATE($A3,AC$1)),'Impactos Data'!$F$2:$G$521,2,FALSE),0)","v":0},{"$f":"IF($E3=\"SI\",VLOOKUP((CONCATENATE($A3,AD$1)),'Impactos Data'!$F$2:$G$521,2,FALSE),0)","v":0},{"$f":"IF($E3=\"SI\",VLOOKUP((CONCATENATE($A3,AE$1)),'Impactos Data'!$F$2:$G$521,2,FALSE),0)","v":0},{"$f":"IF($E3=\"SI\",VLOOKUP((CONCATENATE($A3,AF$1)),'Impactos Data'!$F$2:$G$521,2,FALSE),0)","v":0},{"$f":"IF($E3=\"SI\",VLOOKUP((CONCATENATE($A3,AG$1)),'Impactos Data'!$F$2:$G$521,2,FALSE),0)","v":0},{"$f":"IF($E3=\"SI\",VLOOKUP((CONCATENATE($A3,AH$1)),'Impactos Data'!$F$2:$G$521,2,FALSE),0)","v":0},{"$f":"IF($E3=\"SI\",VLOOKUP((CONCATENATE($A3,AI$1)),'Impactos Data'!$F$2:$G$521,2,FALSE),0)","v":0},{"$f":"IF($E3=\"SI\",VLOOKUP((CONCATENATE($A3,AJ$1)),'Impactos Data'!$F$2:$G$521,2,FALSE),0)","v":0},{"$f":"IF($E3=\"SI\",VLOOKUP((CONCATENATE($A3,AK$1)),'Impactos Data'!$F$2:$G$521,2,FALSE),0)","v":0},{"$f":"IF($E3=\"SI\",VLOOKUP((CONCATENATE($A3,AL$1)),'Impactos Data'!$F$2:$G$521,2,FALSE),0)","v":0},{"$f":"IF($E3=\"SI\",VLOOKUP((CONCATENATE($A3,AM$1)),'Impactos Data'!$F$2:$G$521,2,FALSE),0)","v":0},{"$f":"IF($E3=\"SI\",VLOOKUP((CONCATENATE($A3,AN$1)),'Impactos Data'!$F$2:$G$521,2,FALSE),0)","v":0},{"$f":"IF($E3=\"SI\",VLOOKUP((CONCATENATE($A3,AO$1)),'Impactos Data'!$F$2:$G$521,2,FALSE),0)","v":0},{"$f":"IF($E3=\"SI\",VLOOKUP((CONCATENATE($A3,AP$1)),'Impactos Data'!$F$2:$G$521,2,FALSE),0)","v":0},{"$f":"IF($E3=\"SI\",VLOOKUP((CONCATENATE($A3,AQ$1)),'Impactos Data'!$F$2:$G$521,2,FALSE),0)","v":0},{"$f":"IF($E3=\"SI\",VLOOKUP((CONCATENATE($A3,AR$1)),'Impactos Data'!$F$2:$G$521,2,FALSE),0)","v":0},{"$f":"IF($E3=\"SI\",VLOOKUP((CONCATENATE($A3,AS$1)),'Impactos Data'!$F$2:$G$521,2,FALSE),0)","v":0},{"$f":"IF($E3=\"SI\",VLOOKUP((CONCATENATE($A3,AT$1)),'Impactos Data'!$F$2:$G$521,2,FALSE),0)","v":0},{"$f":"IF($E3=\"SI\",VLOOKUP((CONCATENATE($A3,AU$1)),'Impactos Data'!$F$2:$G$521,2,FALSE),0)","v":0},{"$f":"SUM(AB3:AU3)","v":0},null,null,null,{"$f":"AB3*$X3","v":0},0,0,0,0,0,0,0,0,0,0,0,0,0,0,0,0,0,0,0,{"$f":"SUM(AZ3:BS3)","v":0}]
["CEP3",{"$f":"'Espacio Público'!D3","v":"LUMINARIAS SUSTENTABLES"},{"$f":"'2d Componentes Espacio Público'!S62","v":0},{"$f":"'Espacio Público'!D6","v":"¿En el proyecto se utiliza luminarias sustentables?"},"NO",0,{"$f":"'Espacio Público'!D7","v":"¿Cuántas luminarias fueron en total  instaladas?"},{"$f":"'2d Componentes Espacio Público'!V65","v":0},{"$f":"'Espacio Público'!D12","v":0},{"$f":"'2d Componentes Espacio Público'!V68","v":0},null,null,null,null,null,null,null,null,null,null,null,{"$f":"'Espacio Público'!D14","v":"¿Las luminarias disponen algún sistema dentro del proyecto \n       que produzca su propia fuente energética? (fotovoltaico, \n       etc.)"},{"$f":"'2d Componentes Espacio Público'!V68","v":0},{"$f":"IF(W4=0,1,IF(W4='Espacio Público'!D15,'Espacio Público'!D17,'Espacio Público'!D18))","v":1},null,null,null,{"$f":"IF($E4=\"SI\",VLOOKUP((CONCATENATE($A4,AB$1)),'Impactos Data'!$F$2:$G$521,2,FALSE),0)","v":0},{"$f":"IF($E4=\"SI\",VLOOKUP((CONCATENATE($A4,AC$1)),'Impactos Data'!$F$2:$G$521,2,FALSE),0)","v":0},{"$f":"IF($E4=\"SI\",VLOOKUP((CONCATENATE($A4,AD$1)),'Impactos Data'!$F$2:$G$521,2,FALSE),0)","v":0},{"$f":"IF($E4=\"SI\",VLOOKUP((CONCATENATE($A4,AE$1)),'Impactos Data'!$F$2:$G$521,2,FALSE),0)","v":0},{"$f":"IF($E4=\"SI\",VLOOKUP((CONCATENATE($A4,AF$1)),'Impactos Data'!$F$2:$G$521,2,FALSE),0)","v":0},{"$f":"IF($E4=\"SI\",VLOOKUP((CONCATENATE($A4,AG$1)),'Impactos Data'!$F$2:$G$521,2,FALSE),0)","v":0},{"$f":"IF($E4=\"SI\",VLOOKUP((CONCATENATE($A4,AH$1)),'Impactos Data'!$F$2:$G$521,2,FALSE),0)","v":0},{"$f":"IF($E4=\"SI\",VLOOKUP((CONCATENATE($A4,AI$1)),'Impactos Data'!$F$2:$G$521,2,FALSE),0)","v":0},{"$f":"IF($E4=\"SI\",VLOOKUP((CONCATENATE($A4,AJ$1)),'Impactos Data'!$F$2:$G$521,2,FALSE),0)","v":0},{"$f":"IF($E4=\"SI\",VLOOKUP((CONCATENATE($A4,AK$1)),'Impactos Data'!$F$2:$G$521,2,FALSE),0)","v":0},{"$f":"IF($E4=\"SI\",VLOOKUP((CONCATENATE($A4,AL$1)),'Impactos Data'!$F$2:$G$521,2,FALSE),0)","v":0},{"$f":"IF($E4=\"SI\",VLOOKUP((CONCATENATE($A4,AM$1)),'Impactos Data'!$F$2:$G$521,2,FALSE),0)","v":0},{"$f":"IF($E4=\"SI\",VLOOKUP((CONCATENATE($A4,AN$1)),'Impactos Data'!$F$2:$G$521,2,FALSE),0)","v":0},{"$f":"IF($E4=\"SI\",VLOOKUP((CONCATENATE($A4,AO$1)),'Impactos Data'!$F$2:$G$521,2,FALSE),0)","v":0},{"$f":"IF($E4=\"SI\",VLOOKUP((CONCATENATE($A4,AP$1)),'Impactos Data'!$F$2:$G$521,2,FALSE),0)","v":0},{"$f":"IF($E4=\"SI\",VLOOKUP((CONCATENATE($A4,AQ$1)),'Impactos Data'!$F$2:$G$521,2,FALSE),0)","v":0},{"$f":"IF($E4=\"SI\",VLOOKUP((CONCATENATE($A4,AR$1)),'Impactos Data'!$F$2:$G$521,2,FALSE),0)","v":0},{"$f":"IF($E4=\"SI\",VLOOKUP((CONCATENATE($A4,AS$1)),'Impactos Data'!$F$2:$G$521,2,FALSE),0)","v":0},{"$f":"IF($E4=\"SI\",VLOOKUP((CONCATENATE($A4,AT$1)),'Impactos Data'!$F$2:$G$521,2,FALSE),0)","v":0},{"$f":"IF($E4=\"SI\",VLOOKUP((CONCATENATE($A4,AU$1)),'Impactos Data'!$F$2:$G$521,2,FALSE),0)","v":0},0,null,null,null,0,0,0,0,0,0,0,0,0,0,0,0,0,0,0,0,0,0,0,0,0]
["CEP4",{"$f":"'Espacio Público'!E3","v":"PAVIMENTOS RECICLADOS"},{"$f":"'2d Componentes Espacio Público'!S79","v":0},{"$f":"'Espacio Público'!E6","v":"¿En el proyecto se utilizan pavimentos reciclados?"},"NO",0,{"$f":"'Espacio Público'!E7","v":"¿Qué porcentaje del suelo ocupa?"},{"$f":"'2d Componentes Espacio Público'!V82","v":"<50%"},null,null,null,null,null,null,null,null,null,null,null,null,null,null,null,1,null,null,null,{"$f":"IF($E5=\"SI\",VLOOKUP((CONCATENATE($A5,AB$1)),'Impactos Data'!$F$2:$G$521,2,FALSE),0)","v":0},{"$f":"IF($E5=\"SI\",VLOOKUP((CONCATENATE($A5,AC$1)),'Impactos Data'!$F$2:$G$521,2,FALSE),0)","v":0},{"$f":"IF($E5=\"SI\",VLOOKUP((CONCATENATE($A5,AD$1)),'Impactos Data'!$F$2:$G$521,2,FALSE),0)","v":0},{"$f":"IF($E5=\"SI\",VLOOKUP((CONCATENATE($A5,AE$1)),'Impactos Data'!$F$2:$G$521,2,FALSE),0)","v":0},{"$f":"IF($E5=\"SI\",VLOOKUP((CONCATENATE($A5,AF$1)),'Impactos Data'!$F$2:$G$521,2,FALSE),0)","v":0},{"$f":"IF($E5=\"SI\",VLOOKUP((CONCATENATE($A5,AG$1)),'Impactos Data'!$F$2:$G$521,2,FALSE),0)","v":0},{"$f":"IF($E5=\"SI\",VLOOKUP((CONCATENATE($A5,AH$1)),'Impactos Data'!$F$2:$G$521,2,FALSE),0)","v":0},{"$f":"IF($E5=\"SI\",VLOOKUP((CONCATENATE($A5,AI$1)),'Impactos Data'!$F$2:$G$521,2,FALSE),0)","v":0},{"$f":"IF($E5=\"SI\",VLOOKUP((CONCATENATE($A5,AJ$1)),'Impactos Data'!$F$2:$G$521,2,FALSE),0)","v":0},{"$f":"IF($E5=\"SI\",VLOOKUP((CONCATENATE($A5,AK$1)),'Impactos Data'!$F$2:$G$521,2,FALSE),0)","v":0},{"$f":"IF($E5=\"SI\",VLOOKUP((CONCATENATE($A5,AL$1)),'Impactos Data'!$F$2:$G$521,2,FALSE),0)","v":0},{"$f":"IF($E5=\"SI\",VLOOKUP((CONCATENATE($A5,AM$1)),'Impactos Data'!$F$2:$G$521,2,FALSE),0)","v":0},{"$f":"IF($E5=\"SI\",VLOOKUP((CONCATENATE($A5,AN$1)),'Impactos Data'!$F$2:$G$521,2,FALSE),0)","v":0},{"$f":"IF($E5=\"SI\",VLOOKUP((CONCATENATE($A5,AO$1)),'Impactos Data'!$F$2:$G$521,2,FALSE),0)","v":0},{"$f":"IF($E5=\"SI\",VLOOKUP((CONCATENATE($A5,AP$1)),'Impactos Data'!$F$2:$G$521,2,FALSE),0)","v":0},{"$f":"IF($E5=\"SI\",VLOOKUP((CONCATENATE($A5,AQ$1)),'Impactos Data'!$F$2:$G$521,2,FALSE),0)","v":0},{"$f":"IF($E5=\"SI\",VLOOKUP((CONCATENATE($A5,AR$1)),'Impactos Data'!$F$2:$G$521,2,FALSE),0)","v":0},{"$f":"IF($E5=\"SI\",VLOOKUP((CONCATENATE($A5,AS$1)),'Impactos Data'!$F$2:$G$521,2,FALSE),0)","v":0},{"$f":"IF($E5=\"SI\",VLOOKUP((CONCATENATE($A5,AT$1)),'Impactos Data'!$F$2:$G$521,2,FALSE),0)","v":0},{"$f":"IF($E5=\"SI\",VLOOKUP((CONCATENATE($A5,AU$1)),'Impactos Data'!$F$2:$G$521,2,FALSE),0)","v":0},0,null,null,null,0,0,0,0,0,0,0,0,0,0,0,0,0,0,0,0,0,0,0,0,0]
["CEP5",{"$f":"'Espacio Público'!F3","v":"ELEMENTOS DE SOMBREAMIENTO"},{"$f":"'2d Componentes Espacio Público'!S98","v":0},{"$f":"'Espacio Público'!F6","v":"¿En el proyecto se utilizan elementos de sombreamiento?"},"NO",0,{"$f":"'Espacio Público'!F7","v":"¿Producen sombra en la orientación sur?"},{"$f":"'2d Componentes Espacio Público'!V105","v":0},{"$f":"'Espacio Público'!F10","v":"Respecto al total de m2 del espacio abierto del proyecto, \n        ¿qué superficie ocupan?"},{"$f":"'2d Componentes Espacio Público'!V104","v":0},null,null,null,null,null,null,null,null,null,null,null,{"$f":"'Espacio Público'!F14","v":"¿Incorpora plantas trepadoras o enredaderas de sombra?"},{"$f":"'2d Componentes Espacio Público'!V107","v":0},{"$f":"IF(W6=0,1,IF(W6='Espacio Público'!F15,'Espacio Público'!F17,'Espacio Público'!F18))","v":1},null,null,null,{"$f":"IF($E6=\"SI\",VLOOKUP((CONCATENATE($A6,AB$1)),'Impactos Data'!$F$2:$G$521,2,FALSE),0)","v":0},{"$f":"IF($E6=\"SI\",VLOOKUP((CONCATENATE($A6,AC$1)),'Impactos Data'!$F$2:$G$521,2,FALSE),0)","v":0},{"$f":"IF($E6=\"SI\",VLOOKUP((CONCATENATE($A6,AD$1)),'Impactos Data'!$F$2:$G$521,2,FALSE),0)","v":0},{"$f":"IF($E6=\"SI\",VLOOKUP((CONCATENATE($A6,AE$1)),'Impactos Data'!$F$2:$G$521,2,FALSE),0)","v":0},{"$f":"IF($E6=\"SI\",VLOOKUP((CONCATENATE($A6,AF$1)),'Impactos Data'!$F$2:$G$521,2,FALSE),0)","v":0},{"$f":"IF($E6=\"SI\",VLOOKUP((CONCATENATE($A6,AG$1)),'Impactos Data'!$F$2:$G$521,2,FALSE),0)","v":0},{"$f":"IF($E6=\"SI\",VLOOKUP((CONCATENATE($A6,AH$1)),'Impactos Data'!$F$2:$G$521,2,FALSE),0)","v":0},{"$f":"IF($E6=\"SI\",VLOOKUP((CONCATENATE($A6,AI$1)),'Impactos Data'!$F$2:$G$521,2,FALSE),0)","v":0},{"$f":"IF($E6=\"SI\",VLOOKUP((CONCATENATE($A6,AJ$1)),'Impactos Data'!$F$2:$G$521,2,FALSE),0)","v":0},{"$f":"IF($E6=\"SI\",VLOOKUP((CONCATENATE($A6,AK$1)),'Impactos Data'!$F$2:$G$521,2,FALSE),0)","v":0},{"$f":"IF($E6=\"SI\",VLOOKUP((CONCATENATE($A6,AL$1)),'Impactos Data'!$F$2:$G$521,2,FALSE),0)","v":0},{"$f":"IF($E6=\"SI\",VLOOKUP((CONCATENATE($A6,AM$1)),'Impactos Data'!$F$2:$G$521,2,FALSE),0)","v":0},{"$f":"IF($E6=\"SI\",VLOOKUP((CONCATENATE($A6,AN$1)),'Impactos Data'!$F$2:$G$521,2,FALSE),0)","v":0},{"$f":"IF($E6=\"SI\",VLOOKUP((CONCATENATE($A6,AO$1)),'Impactos Data'!$F$2:$G$521,2,FALSE),0)","v":0},{"$f":"IF($E6=\"SI\",VLOOKUP((CONCATENATE($A6,AP$1)),'Impactos Data'!$F$2:$G$521,2,FALSE),0)","v":0},{"$f":"IF($E6=\"SI\",VLOOKUP((CONCATENATE($A6,AQ$1)),'Impactos Data'!$F$2:$G$521,2,FALSE),0)","v":0},{"$f":"IF($E6=\"SI\",VLOOKUP((CONCATENATE($A6,AR$1)),'Impactos Data'!$F$2:$G$521,2,FALSE),0)","v":0},{"$f":"IF($E6=\"SI\",VLOOKUP((CONCATENATE($A6,AS$1)),'Impactos Data'!$F$2:$G$521,2,FALSE),0)","v":0},{"$f":"IF($E6=\"SI\",VLOOKUP((CONCATENATE($A6,AT$1)),'Impactos Data'!$F$2:$G$521,2,FALSE),0)","v":0},{"$f":"IF($E6=\"SI\",VLOOKUP((CONCATENATE($A6,AU$1)),'Impactos Data'!$F$2:$G$521,2,FALSE),0)","v":0},0,null,null,null,0,0,0,0,0,0,0,0,0,0,0,0,0,0,0,0,0,0,0,0,0]
[]
[]
[]
[]
[]
[]
[]
[]
[]
[]
[]
[]
[null,null,null,null,null,null,null,null,null,null,null,null,null,null,null,null,null,null,null,null,null,null,null,null,null,null,null,{"$f":"AB1","v":1},{"$f":"AC1","v":2},3,4,5,6,7,8,9,10,11,12,13,14,15,16,17,18,19,20,null,null,null,null,{"$f":"AZ1","v":1},{"$f":"BA1","v":2},3,4,5,6,7,8,9,10,11,12,13,14,15,16,17,18,19,20]
[null,null,null,null,null,null,null,null,null,null,null,null,null,null,null,null,null,null,null,null,null,null,null,null,null,null,"SUMA",{"$f":"SUM(AB2:AB8)","v":0},{"$f":"SUM(AC2:AC8)","v":0},0,0,0,0,0,0,0,0,0,0,0,0,0,0,0,0,0,0,null,null,null,"SUMA",{"$f":"SUM(AZ2:AZ6)","v":0},{"$f":"SUM(BA2:BA6)","v":0},0,0,0,0,0,0,0,0,0,0,0,0,0,0,0,0,0,0]
[null,"SUM SI",{"$f":"SUMPRODUCT(C3:C19,F3:F19)","v":0},"COUNT SI",{"$f":"COUNTIF(E2:E18,\"SI\")","v":0}]

{"sheet":"3. Recoleccion de datos","index":22,"n_rows":77,"n_cols":20,"rows_kept":77,"cut":false,"hidden":false,"merged":[[25,12,25,13],[61,6,62,12],[61,13,62,13],[28,12,28,13],[32,8,32,9],[32,10,32,11],[32,12,32,13],[26,12,26,13],[27,8,27,9],[27,10,27,11],[27,12,27,13],[35,12,35,13],[34,8,34,9],[34,10,34,11],[28,6,28,7],[32,6,32,7],[5,13,5,16],[5,18,5,22],[8,1,10,12],[13,1,13,9],[16,2,17,8],[3,5,3,6],[3,9,3,11],[5,3,5,5],[5,7,5,11],[25,6,25,7],[25,8,25,9],[25,10,25,11],[21,2,53,4],[53,6,53,7],[53,8,53,9],[53,10,53,11],[52,6,52,7],[52,8,52,9],[52,10,52,11],[51,6,51,7],[51,8,51,9],[51,10,51,11],[50,6,50,7],[50,8,50,9],[50,10,50,11],[49,6,49,7],[49,8,49,9],[49,10,49,11],[40,6,40,8],[40,11,40,13],[40,14,40,15],[48,6,48,7],[48,8,48,9],[48,10,48,11],[42,10,42,11],[43,6,43,7],[43,8,43,9],[42,6,42,7],[42,8,42,9],[43,10,43,11],[33,10,33,11],[33,12,33,13],[35,10,35,11],[26,6,26,7],[27,6,27,7],[26,8,26,9],[26,10,26,11],[28,8,28,9],[28,10,28,11],[76,6,76,12],[76,13,76,14],[69,2,77,4],[69,6,69,16],[71,6,72,12],[71,13,72,14],[1,1,1,23],[58,6,58,16],[58,2,63,4],[74,6,74,12],[74,13,74,14],[23,6,23,8],[23,11,23,13],[21,6,21,16],[38,6,38,16],[23,14,23,15],[33,6,33,7],[34,6,34,7],[35,6,35,7],[35,8,35,9],[34,12,34,13],[33,8,33,9]]}
[]
[null,"Herramienta para la estimación y evaluación de los impactos de la infraestructura verde"]
[]
[null,null,null,null,null,"1. Introducción ",null,null,null,"2. Preparar evaluación ",null,null,null,null,"3. Recolección de datos",null,null,null,null,"4. Impactos/Resultados"]
[]
[]
[]
[null,"Acerca de esta pestaña:"]
[null,"Esta pestaña recolecta los datos necesarios para la estimación de GEI y otros impactos relevantes"]
[]
[]
[]
[]
[null,"3. Recolección de datos "]
[]
[]
[null,null,"No hay datos adicionales por registrar"]
[]
[]
[]
[]
[null,null,"Supone que:\n\nLuminarias Sustentables LED:\n \nSustitución de luminarias que generan en un ahorro de la demanda o consumo de energía eléctrica.\n\nSi no se conoce el wataje anterior o es instalación de luminarias nuevas se recomienda asignar el valor del wataje anterior, como el wataje correspondiente a una luminaria con luminosidad similar de vapor de sodio. \n\nLuminarias sustentables: renovables \n\nInstalación de luminarias nuevas que generan electricidad por una fuente de energía renovable.\n\nSi no se conocen las horas de uso por año, asume 12 horas de uso diario\n\n** Para ambos casos, si no se conocen las horas de uso por año, se asumen 12 horas de uso diario. Para el caso de vida útil se asignará un valor default de 50,000 horas.\n",null,null,null,"Luminarias Sustentables - LED"]
[]
[null,null,null,null,null,null,"Año de sustitución",null,null,{"$f":"'1c. Registrar datos proyecto'!H20","v":0},null,"Vida útil promedio"]
[]
[null,null,null,null,null,null,"Número de luminarias",null,"Wataje de luminarias nuevas",null,"Wataje anterior",null,"Horas de uso por año "]
[]
[]
[]
[]
[]
[]
[]
[]
[]
[]
[]
[]
[null,null,null,null,null,null,"Luminarias sustentables - Renovables"]
[]
[null,null,null,null,null,null,"Año de sustitución",null,null,{"$f":"'1c. Registrar datos proyecto'!H20","v":0},null,"Vida útil promedio"]
[]
[null,null,null,null,null,null,"Número de luminarias",null,"Wataje de luminarias nuevas",null,"Horas de uso por día"]
[]
[]
[]
[]
[]
[]
[]
[]
[]
[]
[]
[]
[]
[]
[]
[null,null,"Supone que:\n\nLínea base: se utiliza Gas LP\n\nMedida: biodigestores que utilizan excretas de bovinos para la generación de metano.",null,null,null,"Biodigestores"]
[]
[null,null,null,null,null,null,"Número de biodigestores (equipos/año)"]
[null,null,null,null,null,null,"Número de Equipos que sustituyen el uso de gas LP"]
[]
[null,null,null,null,null,null,"Capacidad almacenamiento de excretas (bovinos/equipo)"]
[]
[]
[]
[]
[]
[null,null,"\nPara la Ia generación de \nestos datos, se sugiere utilizar la herramienta Itree. \n\nEstos datos se encuentran en el reporte que genera la herramienta.\n\nEl Manual del Itree lo puedes descargar aquí. \n\n\n\n",null,null,null,"Arbolado y Bosque Urbano"]
[]
[null,null,null,null,null,null,"Eliminación contaminación (gramos/año)"]
[]
[]
[null,null,null,null,null,null,"Secuestro de carbono (kg/año)"]
[]
[null,null,null,null,null,null,"Escurrimiento evitado (metros cúbicos/año)"]

{"sheet":"RegistroDatos","index":23,"n_rows":78,"n_cols":16,"rows_kept":78,"cut":false,"hidden":true,"merged":[[64,1,64,4],[65,1,65,4],[66,1,66,4],[67,1,67,4],[59,1,59,4],[60,1,60,4],[61,1,61,4],[62,1,62,4],[63,1,63,4],[58,1,58,4],[47,1,47,4],[48,1,48,4],[49,1,49,4],[50,1,50,4],[51,1,51,4],[52,1,52,4],[53,1,53,4],[54,1,54,4],[55,1,55,4],[56,1,56,4],[57,1,57,4],[46,1,46,4],[39,1,39,4],[40,1,40,4],[43,1,43,4],[44,1,44,4],[45,1,45,4],[77,1,77,4],[77,6,77,7],[76,1,76,4],[73,6,73,7],[74,6,74,7],[75,6,75,7],[76,6,76,7],[73,1,73,4],[74,1,74,4],[75,1,75,4]]}
[]
[null,"Ahorro de energía"]
[]
[null,"Número de luminarias","Wataje de luminarias nuevas","Wataje anterior","Horas/año","Factor emisión  tCO2e / MWh","KwH ahorrados","tCO2e",null,"Año",{"$f":"'3. Recoleccion de datos'!J24","v":0}]
[null,{"$f":"'3. Recoleccion de datos'!G27","v":0},{"$f":"'3. Recoleccion de datos'!I27","v":0},{"$f":"'3. Recoleccion de datos'!K27","v":0},{"$f":"IF(ISBLANK('3. Recoleccion de datos'!M27),4380,'3. Recoleccion de datos'!M27)","v":4380},{"$f":"IF(K4=O34,M34,IF(K4=O35,M35,IF(K4=O36,M36)))","v":false},{"$f":"((D5-C5)*E5*B5)/1000","v":0},{"$f":"G5*F5/1000","v":0},null,"Vida útil",{"$f":"IF(ISBLANK('3. Recoleccion de datos'!O24),50000,'3. Recoleccion de datos'!O24)/4380","v":11.415525114155251}]
[null,{"$f":"'3. Recoleccion de datos'!G28","v":0},{"$f":"'3. Recoleccion de datos'!H28","v":0},{"$f":"'3. Recoleccion de datos'!I28","v":0},{"$f":"IF(ISBLANK('3. Recoleccion de datos'!M28),4380,'3. Recoleccion de datos'!M28)","v":4380},{"$f":"F5","v":false},{"$f":"((D6-C6)*E6*B6)/1000","v":0},{"$f":"G6*F6/1000","v":0}]
[null,{"$f":"'3. Recoleccion de datos'!G29","v":0},{"$f":"'3. Recoleccion de datos'!H29","v":0},{"$f":"'3. Recoleccion de datos'!I29","v":0},{"$f":"IF(ISBLANK('3. Recoleccion de datos'!M29),4380,'3. Recoleccion de datos'!M29)","v":4380},{"$f":"F6","v":false},0,0]
[null,{"$f":"'3. Recoleccion de datos'!G30","v":0},{"$f":"'3. Recoleccion de datos'!H30","v":0},{"$f":"'3. Recoleccion de datos'!I30","v":0},{"$f":"IF(ISBLANK('3. Recoleccion de datos'!M30),4380,'3. Recoleccion de datos'!M30)","v":4380},false,0,0]
[null,{"$f":"'3. Recoleccion de datos'!G31","v":0},{"$f":"'3. Recoleccion de datos'!H31","v":0},{"$f":"'3. Recoleccion de datos'!I31","v":0},{"$f":"IF(ISBLANK('3. Recoleccion de datos'!M31),4380,'3. Recoleccion de datos'!M31)","v":4380},false,0,0]
[null,{"$f":"'3. Recoleccion de datos'!G32","v":0},{"$f":"'3. Recoleccion de datos'!H32","v":0},{"$f":"'3. Recoleccion de datos'!I32","v":0},{"$f":"IF(ISBLANK('3. Recoleccion de datos'!M32),4380,'3. Recoleccion de datos'!M32)","v":4380},false,0,0]
[null,{"$f":"'3. Recoleccion de datos'!G33","v":0},{"$f":"'3. Recoleccion de datos'!H33","v":0},{"$f":"'3. Recoleccion de datos'!I33","v":0},{"$f":"IF(ISBLANK('3. Recoleccion de datos'!M33),4380,'3. Recoleccion de datos'!M33)","v":4380},false,0,0]
[null,{"$f":"'3. Recoleccion de datos'!G34","v":0},{"$f":"'3. Recoleccion de datos'!H34","v":0},{"$f":"'3. Recoleccion de datos'!I34","v":0},{"$f":"IF(ISBLANK('3. Recoleccion de datos'!M34),4380,'3. Recoleccion de datos'!M34)","v":4380},false,0,0]
[null,{"$f":"'3. Recoleccion de datos'!G35","v":0},{"$f":"'3. Recoleccion de datos'!H35","v":0},{"$f":"'3. Recoleccion de datos'!I35","v":0},{"$f":"IF(ISBLANK('3. Recoleccion de datos'!M35),4380,'3. Recoleccion de datos'!M35)","v":4380},false,0,0]
[null,{"$f":"'3. Recoleccion de datos'!G36","v":0},{"$f":"'3. Recoleccion de datos'!H36","v":0},{"$f":"'3. Recoleccion de datos'!I36","v":0},{"$f":"IF(ISBLANK('3. Recoleccion de datos'!M36),4380,'3. Recoleccion de datos'!M36)","v":4380},false,0,0]
[]
[null,"Emisiones GEI reducidas",null,null,null,{"$f":"SUM(H4:H13)","v":0},"tCO2e"]
[null,"Emisiones GEI reducidas total ",null,null,null,{"$f":"F16*K5","v":0},"tCO2e"]
[]
[null,"Luminarias sustentables"]
[]
[null,"Número de luminarias","Wataje de luminarias nuevas","Horas/año","Factor emisión  tCO2e / MWh","tCO2e",null,null,null,"Año",{"$f":"'3. Recoleccion de datos'!J41","v":0}]
[null,{"$f":"'3. Recoleccion de datos'!G44","v":0},{"$f":"'3. Recoleccion de datos'!I44","v":0},{"$f":"IF(ISBLANK('3. Recoleccion de datos'!K44),4380,'3. Recoleccion de datos'!K44)","v":4380},{"$f":"IF(K21=O34,M34,IF(K21=O35,M35,IF(K21=O36,M36)))","v":false},{"$f":"E22*D22*C22*B22/1000/1000","v":0},null,null,null,"Vida útil",{"$f":"IF(ISBLANK('3. Recoleccion de datos'!O42),50000,'3. Recoleccion de datos'!O42)/4380","v":11.415525114155251}]
[null,{"$f":"'3. Recoleccion de datos'!G45","v":0},{"$f":"'3. Recoleccion de datos'!I45","v":0},{"$f":"IF(ISBLANK('3. Recoleccion de datos'!K45),4380,'3. Recoleccion de datos'!K45)","v":4380},{"$f":"E22","v":false},{"$f":"E23*D23*C23*B23/1000/1000","v":0}]
[null,{"$f":"'3. Recoleccion de datos'!G46","v":0},{"$f":"'3. Recoleccion de datos'!I46","v":0},{"$f":"IF(ISBLANK('3. Recoleccion de datos'!K46),4380,'3. Recoleccion de datos'!K46)","v":4380},{"$f":"E23","v":false},0]
[null,{"$f":"'3. Recoleccion de datos'!G47","v":0},{"$f":"'3. Recoleccion de datos'!I47","v":0},{"$f":"IF(ISBLANK('3. Recoleccion de datos'!K47),4380,'3. Recoleccion de datos'!K47)","v":4380},false,0]
[null,{"$f":"'3. Recoleccion de datos'!G48","v":0},{"$f":"'3. Recoleccion de datos'!I48","v":0},{"$f":"IF(ISBLANK('3. Recoleccion de datos'!K48),4380,'3. Recoleccion de datos'!K48)","v":4380},false,0]
[null,{"$f":"'3. Recoleccion de datos'!G49","v":0},{"$f":"'3. Recoleccion de datos'!I49","v":0},{"$f":"IF(ISBLANK('3. Recoleccion de datos'!K49),4380,'3. Recoleccion de datos'!K49)","v":4380},false,0]
[null,{"$f":"'3. Recoleccion de datos'!G50","v":0},{"$f":"'3. Recoleccion de datos'!I50","v":0},{"$f":"IF(ISBLANK('3. Recoleccion de datos'!K50),4380,'3. Recoleccion de datos'!K50)","v":4380},false,0]
[null,{"$f":"'3. Recoleccion de datos'!G51","v":0},{"$f":"'3. Recoleccion de datos'!I51","v":0},{"$f":"IF(ISBLANK('3. Recoleccion de datos'!K51),4380,'3. Recoleccion de datos'!K51)","v":4380},false,0]
[null,{"$f":"'3. Recoleccion de datos'!G52","v":0},{"$f":"'3. Recoleccion de datos'!I52","v":0},{"$f":"IF(ISBLANK('3. Recoleccion de datos'!K52),4380,'3. Recoleccion de datos'!K52)","v":4380},false,0]
[null,{"$f":"'3. Recoleccion de datos'!G53","v":0},{"$f":"'3. Recoleccion de datos'!I53","v":0},{"$f":"IF(ISBLANK('3. Recoleccion de datos'!K53),4380,'3. Recoleccion de datos'!K53)","v":4380},false,0]
[null,{"$f":"'3. Recoleccion de datos'!G54","v":0},{"$f":"'3. Recoleccion de datos'!I54","v":0},{"$f":"IF(ISBLANK('3. Recoleccion de datos'!K54),4380,'3. Recoleccion de datos'!K54)","v":4380},false,0]
[]
[null,"Emisiones GEI reducidas",null,null,null,{"$f":"SUM(F22:F32)","v":0},"tCO2e",null,null,null,null,null,0.52700000000000002," tCO2e / MWh",2018,"https://www.gob.mx/cms/uploads/attachment/file/442714/Aviso_Factor_de_Emisiones_2018.pdf "]
[null,"Energía",null,null,null,{"$f":"F34*K22","v":0},null,null,null,null,null,null,0.505," tCO2e / MWh",2019,"https://www.gob.mx/cms/uploads/attachment/file/538473/Factor_emision_electrico_2019.pdf"]
[null,null,null,null,null,null,null,null,null,null,null,null,0.49399999999999999," tCO2e / MWh",2020,"https://www.gob.mx/cms/uploads/attachment/file/630693/Aviso_FEE_2020.pdf "]
[]
[null,"Biodigestores de excretas animales"]
[]
[null,"DA",null,null,null,"Valor","Unidades"]
[null,"Número de biodigestores",null,null,null,{"$f":"'3. Recoleccion de datos'!N61","v":0},"equipos/año",null,"A insertar"]
[null,"Fracción de biodigestores que sustituyen uso de gas LP",null,null,null,{"$f":"'3. Recoleccion de datos'!N62","v":0},"Equipos que sustituyen el uso de gas LP",null,"A insertar"]
[null,"Capacidad almacenamiento de excretas",null,null,null,{"$f":"'3. Recoleccion de datos'!N64","v":0},"bovinos/equipo",null,"A insertar"]
[null,"Animales",null,null,null,{"$f":"F43*F41*F42","v":0},"bovinos/año",null,"Cálculo"]
[null,"Vs",null,null,null,2.14,"kg ms/animal-día",null,"CAR"]
[null,"Bo",null,null,null,0.1,"m3 CH4/ kg VS",null,"IPCC y CAR"]
[null,"MCF biodigestor",null,null,null,3.5499999999999997E-2,"%",null,"CAR para biodigestores fugas bajas"]
[null,"MCF almacenaje de sólidos (en LB)",null,null,null,1.4999999999999999E-2,"%",null,"CAR"]
[null,"Biogás producido por biodigestor apoyado",null,null,null,{"$f":"F44*F45*F46*(1-F47)","v":0},"m3 biogás/día",null,"Cálculo"]
[null,"Equivalencia de biogás a gas LP",null,null,null,0.5,"kg gas LP/m3 biogás",null,"Reportado por sistema biobolsa"]
[null,"Gas LP sustituido por día",null,null,null,{"$f":"F49*F50","v":0},"kg gas LP/día",null,"cálculo"]
[null,"Consumo de Gas LP anual en LB",null,null,null,{"$f":"F51*365*1000/1000000000","v":0},"Gg gas LP/año",null,"cálculo"]
[null,"Factor emisión CO2 para gas LP",null,null,null,63100,"kg/TJ",null,"IPCC 2006"]
[null,"Factor emisión CH4 para gas LP",null,null,null,1,"kg/TJ",null,"IPCC 2006"]
[null,"Factor emisión N2O para gas LP",null,null,null,0.1,"kg/TJ",null,"IPCC 2006"]
[null,"PC neto de gas LP",null,null,null,47.3,"TJ/Gg",null,"IPCC 2006"]
[null,"Gas LP a sustituir por año",null,null,null,{"$f":"F56*F52","v":0},"TJ/año",null,"cálculo"]
[null,"Emisiones de CO2 de gas LP a sustituir",null,null,null,{"$f":"F57*F53","v":0},"kg CO2e/año",null,"cálculo"]
[null,"Emisiones de CH4 de gas LP a sustituir",null,null,null,{"$f":"F57*F54*28","v":0},"kg CO2e/año",null,"cálculo"]
[null,"Emisiones de N2O de gas LP a sustituir",null,null,null,{"$f":"F57*F55*265","v":0},"kg CO2e/año",null,"cálculo"]
[null,"Emisiones de gas LP en LB",null,null,null,{"$f":"SUM(F58:F60)","v":0},"kg CO2e/año",null,"cálculo"]
[null,"FE LB de manejo de excretas",null,null,null,{"$f":"F45*F46*F48*0.67*365","v":0.78500550000000002},"kg CH4/ cabeza-año",null,"Cálculo"]
[null,"Emisiones de LB en manejo de excretas",null,null,null,{"$f":"F62*F44*28","v":0},"kg CO2e/año",null,"Cálculo"]
[null,"Emisiones totales de LB",null,null,null,{"$f":"F63+F61","v":0},"kg CO2e/año",null,"Cálculo"]
[null,"FE de biodigestor por fugitivas",null,null,null,{"$f":"F45*F46*F47*0.67*365","v":1.8578463500000002},"kg CH4/ cabeza-año",null,"Cálculo"]
[null,"Emisiones fugitivas del biodigestor",null,null,null,{"$f":"F65*F44*28","v":0},"kg CO2e/año",null,"Cálculo"]
[null,"Mitigación",null,null,null,{"$f":"F64-F66","v":0},"kg CO2e/año",null,"Cálculo"]
[null,"Mitigación",null,null,null,{"$f":"F67/1000","v":0},"tCo2e",null,"Cálculo"]
[]
[]
[]
[null,"Bosque Urbano"]
[]
[null,"Gramos de la contaminación del aire \n(ozono (O3), monóxido de carbono (CO), dióxido de nitrógeno (NO2), material particulado menor a 2.5\nmicrones (PM2.5)  y dióxido de sulfuro (SO2))",null,null,null,{"$f":"'3. Recoleccion de datos'!N72","v":0},"gramos contaminación aire",null,"A insertar",null,null,"1 kilo",1E-3,"tonelada"]
[null,"Kilogramos de carbono al año secuestradas",null,null,null,{"$f":"'3. Recoleccion de datos'!N75","v":0},"kg/año",null,"A insertar",null,null,"1 libra",4.5399999999999998E-4,"tonelada"]
[null,"Escurrimiento evitado (metros cúbicos)",null,null,null,{"$f":"'3. Recoleccion de datos'!N77","v":0},"metros cúbicos",null,"A insertar",null,null,"1 pie cúbico",2.8316999999999998E-2,"metro cúbico "]
[null,"Toneladas de carbono al año ",null,null,null,{"$f":"F75*M74","v":0},"toneladas CO2 / año",null,"Cálculo"]
[null,"Escurrimiento evitado (metros cúbicos)",null,null,null,{"$f":"F76","v":0},"Escurrimiento evitado m3/año",null,"Cálculo"]

{"sheet":"RegistroTotal","index":24,"n_rows":45,"n_cols":33,"rows_kept":45,"cut":false,"hidden":true,"merged":[]}
[null,"IDText",{"$f":"F2&\"  \"&F3&\"   \"&RIGHT(C2,3)","v":"0  0   0"}]
[null,"Clave proyecto",{"$f":"'1c. Registrar datos proyecto'!H17","v":0},null,"Estado",{"$f":"'1c. Registrar datos proyecto'!H18","v":0},null,"Población beneficiaria",{"$f":"'1c. Registrar datos proyecto'!H25","v":0}]
[null,"Nombre",{"$f":"'1c. Registrar datos proyecto'!R17","v":0},null,"Año ejecución",{"$f":"'1c. Registrar datos proyecto'!H20","v":0}]
[]
[null,"Grupo impacto","Total beneficios","% ",null,null,null,"Total presupuesto",{"$f":"'1c. Registrar datos proyecto'!H24","v":0}]
[null,{"$f":"N8","v":"Adaptación"},{"$f":"SUM(N14:R14)","v":0},{"$f":"C6/SUM($C$6:$C$10)","v":{"$error":"#DIV/0!"}},null,null,null,"Total presupuesto IV",{"$f":"RegistroP!C21+RegistroM!C21+RegistroB!C20+RegistroA!C20","v":0}]
[null,{"$f":"S8","v":"Mitigación"},{"$f":"SUM(S14:T14)","v":0},{"$f":"C7/SUM($C$6:$C$10)","v":{"$error":"#DIV/0!"}}]
[null,{"$f":"U8","v":"Ambiental"},{"$f":"SUM(U14:Z14)","v":0},{"$error":"#DIV/0!"},null,null,null,null,{"$f":"IF(I6>I5,CORREGIR REGISTRO,0)","v":0},null,null,null,null,"Adaptación","Adaptación","Adaptación","Adaptación","Adaptación","Mitigación","Mitigación","Ambiental","Ambiental","Ambiental","Ambiental","Ambiental","Ambiental","Social","Social","Sociales","Social","Social","Económicos","Económicos"]
[null,{"$f":"AA8","v":"Social"},{"$f":"SUM(AA14:AE14)","v":0},{"$error":"#DIV/0!"},null,null,null,null,null,null,null,null,"Eje",1,2,3,4,5,6,7,8,9,10,11,12,13,14,15,16,17,18,19,20]
[null,{"$f":"AF8","v":"Económicos"},{"$f":"SUM(AF14:AG14)","v":0},{"$error":"#DIV/0!"},null,null,null,null,null,null,null,null,"Agua",{"$f":"RegistroA!AZ20","v":0},{"$f":"RegistroA!BA20","v":0},{"$f":"RegistroA!BB20","v":0},{"$f":"RegistroA!BC20","v":0},{"$f":"RegistroA!BD20","v":0},{"$f":"RegistroA!BE20","v":0},{"$f":"RegistroA!BF20","v":0},{"$f":"RegistroA!BG20","v":0},{"$f":"RegistroA!BH20","v":0},{"$f":"RegistroA!BI20","v":0},{"$f":"RegistroA!BJ20","v":0},{"$f":"RegistroA!BK20","v":0},{"$f":"RegistroA!BL20","v":0},{"$f":"RegistroA!BM20","v":0},{"$f":"RegistroA!BN20","v":0},{"$f":"RegistroA!BO20","v":0},{"$f":"RegistroA!BP20","v":0},{"$f":"RegistroA!BQ20","v":0},{"$f":"RegistroA!BR20","v":0},{"$f":"RegistroA!BS20","v":0}]
[null,null,null,null,null,null,null,null,null,null,null,null,"Biodiversidad",{"$f":"RegistroB!BN20","v":0},{"$f":"RegistroB!BO20","v":0},{"$f":"RegistroB!BP20","v":0},{"$f":"RegistroB!BQ20","v":0},{"$f":"RegistroB!BR20","v":0},{"$f":"RegistroB!BS20","v":0},{"$f":"RegistroB!BT20","v":0},{"$f":"RegistroB!BU20","v":0},{"$f":"RegistroB!BV20","v":0},{"$f":"RegistroB!BW20","v":0},{"$f":"RegistroB!BX20","v":0},{"$f":"RegistroB!BY20","v":0},{"$f":"RegistroB!BZ20","v":0},{"$f":"RegistroB!CA20","v":0},{"$f":"RegistroB!CB20","v":0},{"$f":"RegistroB!CC20","v":0},{"$f":"RegistroB!CD20","v":0},{"$f":"RegistroB!CE20","v":0},{"$f":"RegistroB!CF20","v":0},{"$f":"RegistroB!CG20","v":0}]
[null,"CODIGO","COMPONENTE","SELECCIONADO","TOTAL IMPACTO","% IMPACTO","DETALLE DATO","DATO INPUT",null,null,null,null,"Movilidad",{"$f":"RegistroM!AZ20","v":0},{"$f":"RegistroM!BA20","v":0},{"$f":"RegistroM!BB20","v":0},{"$f":"RegistroM!BC20","v":0},{"$f":"RegistroM!BD20","v":0},{"$f":"RegistroM!BE20","v":0},{"$f":"RegistroM!BF20","v":0},{"$f":"RegistroM!BG20","v":0},{"$f":"RegistroM!BH20","v":0},{"$f":"RegistroM!BI20","v":0},{"$f":"RegistroM!BJ20","v":0},{"$f":"RegistroM!BK20","v":0},{"$f":"RegistroM!BL20","v":0},{"$f":"RegistroM!BM20","v":0},{"$f":"RegistroM!BN20","v":0},{"$f":"RegistroM!BO20","v":0},{"$f":"RegistroM!BP20","v":0},{"$f":"RegistroM!BQ20","v":0},{"$f":"RegistroM!BR20","v":0},{"$f":"RegistroM!BS20","v":0}]
[null,{"$f":"RegistroA!A2","v":"CA1"},{"$f":"RegistroA!B2","v":"BIODIGESTORES"},{"$f":"RegistroA!E2","v":"NO"},{"$f":"RegistroA!AV2","v":0},{"$f":"E13/SUM($C$6:$C$10)","v":{"$error":"#DIV/0!"}},{"$f":"RegistroA!H2","v":0},"biodigestores",null,null,null,null,"Espacio Público",{"$f":"RegistroP!AZ20","v":0},{"$f":"RegistroP!BA20","v":0},{"$f":"RegistroP!BB20","v":0},{"$f":"RegistroP!BC20","v":0},{"$f":"RegistroP!BD20","v":0},{"$f":"RegistroP!BE20","v":0},{"$f":"RegistroP!BF20","v":0},{"$f":"RegistroP!BG20","v":0},{"$f":"RegistroP!BH20","v":0},{"$f":"RegistroP!BI20","v":0},{"$f":"RegistroP!BJ20","v":0},{"$f":"RegistroP!BK20","v":0},{"$f":"RegistroP!BL20","v":0},{"$f":"RegistroP!BM20","v":0},{"$f":"RegistroP!BN20","v":0},{"$f":"RegistroP!BO20","v":0},{"$f":"RegistroP!BP20","v":0},{"$f":"RegistroP!BQ20","v":0},{"$f":"RegistroP!BR20","v":0},{"$f":"RegistroP!BS20","v":0}]
[null,{"$f":"RegistroA!A3","v":"CA2"},{"$f":"RegistroA!B3","v":"PRESAS FILTRANTES"},{"$f":"RegistroA!E3","v":"NO"},{"$f":"RegistroA!AV3","v":0},{"$f":"E14/SUM($C$6:$C$10)","v":{"$error":"#DIV/0!"}},{"$f":"RegistroA!H3","v":0},"superficie aproximada (m2)",null,null,null,null,"Total impacto",{"$f":"SUM(N10:N13)","v":0},{"$f":"SUM(O10:O13)","v":0},0,0,0,0,0,0,0,0,0,0,0,0,0,0,0,0,{"$f":"SUM(AF10:AF13)","v":0},{"$f":"SUM(AG10:AG13)","v":0}]
[null,{"$f":"RegistroA!A4","v":"CA3"},{"$f":"RegistroA!B4","v":"CUNETAS VERDES"},{"$f":"RegistroA!E4","v":"NO"},{"$f":"RegistroA!AV4","v":0},{"$error":"#DIV/0!"},{"$f":"RegistroA!H4","v":0},"metros lineales"]
[null,{"$f":"RegistroA!A5","v":"CA4"},{"$f":"RegistroA!B5","v":"DRENAJE SEPARATIVO"},{"$f":"RegistroA!E5","v":"NO"},{"$f":"RegistroA!AV5","v":0},{"$error":"#DIV/0!"},{"$f":"RegistroA!H5","v":0},{"$f":"RegistroA!G5","v":"metros lineales conducto para  aguas de lluvia"}]
[null,{"$f":"RegistroA!A6","v":"CA5"},{"$f":"RegistroA!B6","v":"HUMEDAL SEMIARTIFICIAL"},{"$f":"RegistroA!E6","v":"NO"},{"$f":"RegistroA!AV6","v":0},{"$error":"#DIV/0!"},{"$f":"RegistroA!H6","v":0},"m2"]
[null,{"$f":"RegistroA!A7","v":"CA6"},{"$f":"RegistroA!B7","v":"PAVIMENTOS PERMEABLES"},{"$f":"RegistroA!E7","v":"NO"},{"$f":"RegistroA!AV7","v":0},{"$error":"#DIV/0!"},{"$f":"RegistroA!H7","v":0},{"$f":"RegistroA!G7","v":" % del total del suelo antropizado con pavimento permeable"}]
[null,{"$f":"RegistroA!A8","v":"CA7"},{"$f":"RegistroA!B8","v":"POZOS DE ABSORCIÓN/INFILTRACIÓN"},{"$f":"RegistroA!E8","v":"NO"},{"$f":"RegistroA!AV8","v":0},{"$error":"#DIV/0!"},{"$f":"RegistroA!H8","v":0},"número de pozos"]
[null,{"$f":"RegistroA!A9","v":"CA8"},{"$f":"RegistroA!B9","v":" JARDINERAS FILTRANTES"},{"$f":"RegistroA!E9","v":"NO"},{"$f":"RegistroA!AV9","v":0},{"$error":"#DIV/0!"},{"$f":"RegistroA!H9","v":0},"superficie aproximada (m2)",null,null,null,null,null,null,null,null,null,null,null,null,null,null,null,null,null,null,null,null,40.25]
[null,{"$f":"RegistroB!A2","v":"CB1"},{"$f":"RegistroB!B2","v":"ARBOLADO"},{"$f":"RegistroB!E2","v":"NO"},{"$f":"RegistroB!AV2","v":0},{"$error":"#DIV/0!"},{"$f":"RegistroB!H2+RegistroB!L2+RegistroB!P2+RegistroB!T2+RegistroB!X2","v":0},"número de especies",null,null,null,null,null,null,null,null,null,null,null,null,null,null,null,null,null,null,null,null,36.5]
[null,{"$f":"RegistroB!A3","v":"CB2"},{"$f":"RegistroB!B3","v":"BOSQUE URBANO"},{"$f":"RegistroB!E3","v":"NO"},{"$f":"RegistroB!AV3","v":0},{"$error":"#DIV/0!"},{"$f":"RegistroB!H3","v":0},"hectáreas de bosque ",null,null,null,null,null,null,null,null,null,null,null,null,null,null,null,null,null,null,null,null,39]
[null,{"$f":"RegistroB!A4","v":"CB3"},{"$f":"RegistroB!B4","v":"JARDINES EDUCATIVOS"},{"$f":"RegistroB!E4","v":"NO"},{"$f":"RegistroB!AV4","v":0},{"$error":"#DIV/0!"},{"$f":"RegistroB!J4","v":0},"m2 total de superficie ",null,null,null,null,null,null,null,null,null,null,null,null,null,null,null,null,null,null,null,null,35.25]
[null,{"$f":"RegistroB!A5","v":"CB4"},{"$f":"RegistroB!B5","v":"HUERTOS URBANOS"},{"$f":"RegistroB!E5","v":"NO"},{"$f":"RegistroB!AV5","v":0},{"$error":"#DIV/0!"},{"$f":"RegistroB!H5","v":0},{"$f":"RegistroB!G5","v":"m2 superficie de huerto "},null,null,null,null,null,null,null,null,null,null,null,null,null,null,null,null,null,null,null,null,33.25]
[null,{"$f":"RegistroB!A6","v":"CB5"},{"$f":"RegistroB!B6","v":"RENATURALIZACION DE ELEMENTOS FLUVIALES"},{"$f":"RegistroB!E6","v":"NO"},{"$f":"RegistroB!AV6","v":0},{"$error":"#DIV/0!"},{"$f":"RegistroB!H6","v":0},"hectáreas de la superficie de laderas recuperada",null,null,null,null,null,null,null,null,null,null,null,null,null,null,null,null,null,null,null,null,26.75]
[null,{"$f":"RegistroB!A7","v":"CB6"},{"$f":"RegistroB!B7","v":"DESENTUBADO DE RIOS"},{"$f":"RegistroB!E7","v":"NO"},{"$f":"RegistroB!AV7","v":0},{"$error":"#DIV/0!"},{"$f":"RegistroB!H7+RegistroB!J7","v":0},"superficie total (m2)  recuperada",null,null,null,null,null,null,null,null,null,null,null,null,null,null,null,null,null,null,null,null,25.25]
[null,{"$f":"RegistroM!A2","v":"CMO1"},{"$f":"RegistroM!B2","v":"URBANISMO TÁCTICO"},{"$f":"RegistroM!E2","v":"NO"},{"$f":"RegistroM!AV2","v":0},{"$error":"#DIV/0!"},{"$f":"RegistroM!T2","v":0},"elementos integrados",null,null,null,null,null,null,null,null,null,null,null,null,null,null,null,null,null,null,null,null,29.25]
[null,{"$f":"RegistroM!A3","v":"CMO2"},{"$f":"RegistroM!B3","v":"CICLOVÍAS"},{"$f":"RegistroM!E3","v":"NO"},{"$f":"RegistroM!AV3","v":0},{"$error":"#DIV/0!"},{"$f":"RegistroM!N3","v":0},"metros lineales de ciclovías",null,null,null,null,null,null,null,null,null,null,null,null,null,null,null,null,null,null,null,null,35.25]
[null,{"$f":"RegistroM!A4","v":"CMO3"},{"$f":"RegistroM!B4","v":"CORREDOR PEATONAL "},{"$f":"RegistroM!E4","v":"NO"},{"$f":"RegistroM!AV4","v":0},{"$error":"#DIV/0!"},null,null,null,null,null,null,null,null,null,null,null,null,null,null,null,null,null,null,null,null,null,null,29.5]
[null,{"$f":"RegistroM!A5","v":"CMO4"},{"$f":"RegistroM!B5","v":"BANQUETAS"},{"$f":"RegistroM!E5","v":"NO"},{"$f":"RegistroM!AV5","v":0},{"$error":"#DIV/0!"},{"$f":"RegistroM!H5","v":0},"ancho aproximado de banqueta",null,null,null,null,null,null,null,null,null,null,null,null,null,null,null,null,null,null,null,null,27.75]
[null,{"$f":"RegistroM!A6","v":"CMO5"},{"$f":"RegistroM!B6","v":"ZONA TRANSPORTE PÚBLICO"},{"$f":"RegistroM!E6","v":"NO"},{"$f":"RegistroM!AV6","v":0},{"$error":"#DIV/0!"},{"$f":"RegistroM!H6","v":0},{"$f":"RegistroM!G6","v":"metros lineales de carril transporte público"},null,null,null,null,null,null,null,null,null,null,null,null,null,null,null,null,null,null,null,null,32.25]
[null,{"$f":"RegistroM!A7","v":"CMO6"},{"$f":"RegistroM!B7","v":"ZONA CARGA SOSTENIBLE"},{"$f":"RegistroM!E7","v":"NO"},{"$f":"RegistroM!AV7","v":0},{"$error":"#DIV/0!"},{"$f":"RegistroM!H7","v":0},{"$f":"RegistroM!G7","v":"metros lineales de carril para carga/descarga "},null,null,null,null,null,null,null,null,null,null,null,null,null,null,null,null,null,null,null,null,31.25]
[null,{"$f":"RegistroM!A8","v":"CMO7"},{"$f":"RegistroM!B8","v":"ZONA VEHÍCULO PRIVADO SOSTENIBLE"},{"$f":"RegistroM!E8","v":"NO"},{"$f":"RegistroM!AV8","v":0},{"$error":"#DIV/0!"},{"$f":"RegistroM!H8","v":0},{"$f":"RegistroM!G8","v":"metros lineales de carril para vehículo sostenible "},null,null,null,null,null,null,null,null,null,null,null,null,null,null,null,null,null,null,null,null,49.5]
[null,{"$f":"RegistroP!A2","v":"CEP1"},{"$f":"RegistroP!B2","v":"MOBILIARIO URBANO SOSTENIBLE"},{"$f":"RegistroP!E2","v":"NO"},{"$f":"RegistroP!AV2","v":0},{"$error":"#DIV/0!"},{"$f":"RegistroP!H2","v":0},"mobiliario que se utiliza",null,null,null,null,null,null,null,null,null,null,null,null,null,null,null,null,null,null,null,null,38]
[null,{"$f":"RegistroP!A3","v":"CEP2"},{"$f":"RegistroP!B3","v":"MOBILIARIO HIDRÁULICO CERTIFICADO"},{"$f":"RegistroP!E3","v":"NO"},{"$f":"RegistroP!AV3","v":0},{"$error":"#DIV/0!"},{"$f":"RegistroP!H3","v":0},{"$f":"RegistroP!G3","v":"m3 de agua reciclados (m3 /día)"},null,null,null,null,null,null,null,null,null,null,null,null,null,null,null,null,null,null,null,null,29.25]
[null,{"$f":"RegistroP!A4","v":"CEP3"},{"$f":"RegistroP!B4","v":"LUMINARIAS SUSTENTABLES"},{"$f":"RegistroP!E4","v":"NO"},{"$f":"RegistroP!AV4","v":0},{"$error":"#DIV/0!"},{"$f":"RegistroP!H4","v":0},"de luminarias que utilizan energía renovable",null,null,null,null,null,null,null,null,null,null,null,null,null,null,null,null,null,null,null,null,39.25]
[null,{"$f":"RegistroP!A5","v":"CEP4"},{"$f":"RegistroP!B5","v":"PAVIMENTOS RECICLADOS"},{"$f":"RegistroP!E5","v":"NO"},{"$f":"RegistroP!AV5","v":0},{"$error":"#DIV/0!"},{"$f":"RegistroP!H5","v":"<50%"},"de suelo",null,null,null,null,null,null,null,null,null,null,null,null,null,null,null,null,null,null,null,null,35.25]
[null,{"$f":"RegistroP!A6","v":"CEP5"},{"$f":"RegistroP!B6","v":"ELEMENTOS DE SOMBREAMIENTO"},{"$f":"RegistroP!E6","v":"NO"},{"$f":"RegistroP!AV6","v":0},{"$error":"#DIV/0!"},{"$f":"RegistroP!J6","v":0},"del espacio abierto ",null,null,null,null,null,null,null,null,null,null,null,null,null,null,null,null,null,null,null,null,30.75]
[null,null,null,null,null,null,null,null,null,null,null,null,null,null,null,null,null,null,null,null,null,null,null,null,null,null,null,null,40.75]
[null,null,{"$f":"COUNTIF(D13:D38,\"SI\")","v":0},null,null,{"$f":"SUM(F13:F38)","v":{"$error":"#DIV/0!"}}]
[]
[null,"Mitigación"]
[null,null,{"$f":"RegistroDatos!F17","v":0},"Emisiones reducidas al año por iluminación eficiente"]
[null,null,{"$f":"RegistroDatos!F34","v":0},"Emisiones reducidas por iluminación con energía renovable"]
[null,null,{"$f":"RegistroDatos!F68","v":0},"Emisiones reducidas por la instalación de biodigestor"]

{"sheet":"4. Impactos-Resultados","index":25,"n_rows":78,"n_cols":29,"rows_kept":78,"cut":false,"hidden":false,"merged":[[67,11,67,19],[68,11,68,19],[69,11,69,19],[70,11,70,19],[71,11,71,19],[72,11,72,19],[53,16,53,21],[70,20,70,21],[71,20,71,21],[54,20,54,21],[55,20,55,21],[56,20,56,21],[57,20,57,21],[58,20,58,21],[59,20,59,21],[60,20,60,21],[61,20,61,21],[62,20,62,21],[67,20,67,21],[68,20,68,21],[69,20,69,21],[63,20,63,21],[64,20,64,21],[65,20,65,21],[66,20,66,21],[54,11,54,19],[55,11,55,19],[56,11,56,19],[57,11,57,19],[58,11,58,19],[74,9,75,12],[74,13,75,14],[75,16,76,19],[75,20,76,21],[76,9,77,12],[76,13,77,14],[77,16,78,19],[77,20,78,21],[72,9,73,10],[73,11,73,19],[54,9,58,10],[59,9,60,10],[61,9,66,10],[67,9,71,10],[72,20,72,21],[73,20,73,21],[62,11,62,19],[63,11,63,19],[3,5,3,6],[45,14,45,15],[46,14,46,15],[42,14,42,15],[43,14,43,15],[44,14,44,15],[22,1,22,6],[30,14,30,15],[28,14,28,15],[29,14,29,15],[5,3,5,5],[5,7,5,11],[5,13,5,16],[18,1,18,3],[13,14,13,22],[20,1,20,3],[13,1,13,9],[51,9,52,23],[39,14,39,15],[51,1,52,6],[47,14,47,15],[26,14,26,15],[21,1,21,6],[59,11,59,19],[60,11,60,19],[61,11,61,19],[36,14,36,15],[37,14,37,15],[38,14,38,15],[64,11,64,19],[65,11,65,19],[66,11,66,19],[5,18,5,22],[8,1,10,12],[16,4,16,6],[16,8,16,10],[16,11,17,23],[16,1,16,3],[50,1,50,3],[40,14,40,15],[41,14,41,15],[49,14,49,15],[48,14,48,15],[21,16,21,23],[21,8,21,13],[21,14,21,15],[22,14,22,15],[23,14,23,15],[31,14,31,15],[32,14,32,15],[33,14,33,15],[34,14,34,15],[35,14,35,15],[1,1,1,23],[66,22,66,23],[67,22,67,23],[68,22,68,23],[69,22,69,23],[70,22,70,23],[71,22,71,23],[72,22,72,23],[73,22,73,23],[57,22,57,23],[58,22,58,23],[59,22,59,23],[60,22,60,23],[61,22,61,23],[62,22,62,23],[63,22,63,23],[64,22,64,23],[65,22,65,23],[54,22,54,23],[55,22,55,23],[56,22,56,23],[24,14,24,15],[25,14,25,15],[27,14,27,15]]}
[]
[null,"   Herramienta para la estimación y la evaluación de los impactos de la infraestructura verde"]
[]
[null,null,null,null,null,"1. Introducción ",null,null,null,"2. Preparar evaluación ",null,null,null,null,"3. Recolección de datos",null,null,null,null,"4. Impactos/Resultados"]
[]
[]
[]
[null,"Acerca de esta pestaña:"]
[null,"Esta pestaña muestra los resultados de la valoración de los impactos climáticos, ambientales, sociales y económicos de los compuestos de infraestructura verde seleccionados. "]
[]
[]
[]
[]
[null,"4a. Mapa de impactos",null,null,null,null,null,null,null,null,null,null,null,null,"Resumen de resultados"]
[]
[]
[null,{"$f":"'1c. Registrar datos proyecto'!B17","v":"    Clave del Proyecto"},null,null,{"$f":"'1c. Registrar datos proyecto'!H17","v":0},null,null,null,{"$f":"'1c. Registrar datos proyecto'!N17","v":"Nombre del Proyecto"},null,null,{"$f":"'1c. Registrar datos proyecto'!R17","v":0}]
[]
[null,{"$f":"'1c. Registrar datos proyecto'!B20","v":"    Año de ejecución"},null,null,{"$f":"'1c. Registrar datos proyecto'!H20","v":0}]
[]
[null,"Estado "]
[null,"Contribución por grupo de impactos",null,null,null,null,null,null,"Componentes de infraestructura verde",null,null,null,null,null,"Contribución de impactos",null,"Detalles del componente"]
[]
[]
[]
[]
[]
[]
[]
[]
[]
[]
[]
[]
[]
[]
[]
[]
[]
[]
[]
[]
[]
[]
[]
[]
[]
[]
[]
[]
[]
[null,"Componentes de infraestructura verde",null,null,null,null,null,null,null,"Mapa de impactos "]
[]
[null,null,null,null,null,null,null,null,null,null,null,null,null,null,null,null,null,null,null,null,null,null,null,null,null,0.1,0.15,0.2,0.3]
[null,null,null,null,null,null,null,null,null,"Adaptación",null,{"$f":"\"  \"&Impactos!C2","v":"  Prevención de inundaciones, regulación de escorrentías"},null,null,null,null,null,null,null,null,{"$f":"RegistroTotal!$N$14","v":0},null,{"$f":"IF(U55<=Z55,\"Muy Bajo\",IF(AND(U55>Z55,U55<AA55),\"Bajo\",IF(AND(U55>AA55,U55<AB55),\"Medio\",IF(AND(U55>AB55,U55<AC55),\" Alto\",IF(U55>=AC55,\"Muy Alto\")))))","v":"Muy Bajo"},null,40.25,{"$f":"Y55*$Z$54","v":4.0250000000000004},{"$f":"Y55*$AA$54","v":6.0374999999999996},{"$f":"Y55*$AB$54","v":8.0500000000000007},{"$f":"Y55*$AC$54","v":12.074999999999999}]
[null,null,null,null,null,null,null,null,null,null,null,{"$f":"\"  \"&Impactos!C3","v":"  Reducción de los riesgos derivados de las inundaciones, regulación de avenidas."},null,null,null,null,null,null,null,null,{"$f":"RegistroTotal!$O$14","v":0},null,{"$f":"IF(U56<=Z56,\"Muy Bajo\",IF(AND(U56>Z56,U56<AA56),\"Bajo\",IF(AND(U56>AA56,U56<AB56),\"Medio\",IF(AND(U56>AB56,U56<AC56),\" Alto\",IF(U56>=AC56,\"Muy Alto\")))))","v":"Muy Bajo"},null,36.5,{"$f":"Y56*$Z$54","v":3.6500000000000004},{"$f":"Y56*$AA$54","v":5.4749999999999996},{"$f":"Y56*$AB$54","v":7.3000000000000007},{"$f":"Y56*$AC$54","v":10.95}]
[null,null,null,null,null,null,null,null,null,null,null,{"$f":"\"  \"&Impactos!C4","v":"  Incremento de la recarga de agua de los acuíferos"},null,null,null,null,null,null,null,null,{"$f":"RegistroTotal!$P$14","v":0},null,"Muy Bajo",null,39,3.9000000000000004,5.85,7.8000000000000007,11.7]
[null,null,null,null,null,null,null,null,null,null,null,{"$f":"\"  \"&Impactos!C5","v":"  Regulación térmica y disminución de las islas urbanas de calor"},null,null,null,null,null,null,null,null,{"$f":"RegistroTotal!$Q$14","v":0},null,"Muy Bajo",null,35.25,3.5250000000000004,5.2874999999999996,7.0500000000000007,10.574999999999999]
[null,null,null,null,null,null,null,null,null,null,null,{"$f":"\"  \"&Impactos!C6","v":"  Mejora de la conectividad ecológica."},null,null,null,null,null,null,null,null,{"$f":"RegistroTotal!R14","v":0},null,"Muy Bajo",null,33.25,3.3250000000000002,4.9874999999999998,6.65,9.9749999999999996]
[null,null,null,null,null,null,null,null,null,"Mitigación",null,{"$f":"\"  \"&Impactos!C7","v":"  Secuestro de carbono "},null,null,null,null,null,null,null,null,{"$f":"RegistroTotal!S14","v":0},null,"Muy Bajo",null,26.75,2.6750000000000003,4.0125000000000002,5.3500000000000005,8.0250000000000004]
[null,null,null,null,null,null,null,null,null,null,null,{"$f":"\"  \"&Impactos!C8","v":"  Reducción de emisiones de GEI"},null,null,null,null,null,null,null,null,{"$f":"RegistroTotal!T14","v":0},null,"Muy Bajo",null,25.25,2.5250000000000004,3.7874999999999996,5.0500000000000007,7.5749999999999993]
[null,null,null,null,null,null,null,null,null,"Ambientales",null,{"$f":"\"  \"&Impactos!C9","v":"  Mejora de la calidad del aire"},null,null,null,null,null,null,null,null,{"$f":"RegistroTotal!U14","v":0},null,"Muy Bajo",null,29.25,2.9250000000000003,4.3875000000000002,5.8500000000000005,8.7750000000000004]
[null,null,null,null,null,null,null,null,null,null,null,{"$f":"\"  \"&Impactos!C10","v":"  Mejora de la calidad del agua (purificación del agua)"},null,null,null,null,null,null,null,null,{"$f":"RegistroTotal!V14","v":0},null,"Muy Bajo",null,35.25,3.5250000000000004,5.2874999999999996,7.0500000000000007,10.574999999999999]
[null,null,null,null,null,null,null,null,null,null,null,{"$f":"\"  \"&Impactos!C11","v":"  Reducción de la contaminación por ruido"},null,null,null,null,null,null,null,null,{"$f":"RegistroTotal!W14","v":0},null,"Muy Bajo",null,29.5,2.95,4.4249999999999998,5.9,8.85]
[null,null,null,null,null,null,null,null,null,null,null,{"$f":"\"  \"&Impactos!C12","v":"  Control de la erosión del suelo"},null,null,null,null,null,null,null,null,{"$f":"RegistroTotal!X14","v":0},null,"Muy Bajo",null,27.75,2.7750000000000004,4.1624999999999996,5.5500000000000007,8.3249999999999993]
[{"$f":"RegistroTotal!C40*3","v":0},null,null,null,null,null,null,null,null,null,null,{"$f":"\"  \"&Impactos!C13","v":"  Mantenimiento, protección y mejora de hábitats, vida silvestre y biodiversidad"},null,null,null,null,null,null,null,null,{"$f":"RegistroTotal!Y14","v":0},null,"Muy Bajo",null,32.25,3.2250000000000001,4.8374999999999995,6.45,9.6749999999999989]
[null,null,null,null,null,null,null,null,null,null,null,{"$f":"\"  \"&Impactos!C14","v":"  Producción de servicios ecosistémicos"},null,null,null,null,null,null,null,null,{"$f":"RegistroTotal!Z14","v":0},null,"Muy Bajo",null,31.25,3.125,4.6875,6.25,9.375]
[null,null,null,null,null,null,null,null,null,"Sociales",null,{"$f":"\"  \"&Impactos!C15","v":"  Mejora de los valores estéticos"},null,null,null,null,null,null,null,null,{"$f":"RegistroTotal!AA14","v":0},null,"Muy Bajo",null,49.5,4.95,7.4249999999999998,9.9,14.85]
[null,null,null,null,null,null,null,null,null,null,null,{"$f":"\"  \"&Impactos!C16","v":"  Mejora accesibilidad de recursos para deporte, cultura, formación y recreación"},null,null,null,null,null,null,null,null,{"$f":"RegistroTotal!AB14","v":0},null,"Muy Bajo",null,38,3.8000000000000003,5.7,7.6000000000000005,11.4]
[null,null,null,null,null,null,null,null,null,null,null,{"$f":"\"  \"&Impactos!C17","v":"  Mejora de la salud y bienestar"},null,null,null,null,null,null,null,null,{"$f":"RegistroTotal!AC14","v":0},null,"Muy Bajo",null,29.25,2.9250000000000003,4.3875000000000002,5.8500000000000005,8.7750000000000004]
[null,null,null,null,null,null,null,null,null,null,null,{"$f":"\"  \"&Impactos!C18","v":"  Generación de recursos comunitarios (fortalecimiento de la ciudadanía)"},null,null,null,null,null,null,null,null,{"$f":"RegistroTotal!AD14","v":0},null,"Muy Bajo",null,39.25,3.9250000000000003,5.8875000000000002,7.8500000000000005,11.775]
[null,null,null,null,null,null,null,null,null,null,null,{"$f":"\"  \"&Impactos!C19","v":"  Fortalecimiento de sentimiento de pertenencia e identidad"},null,null,null,null,null,null,null,null,{"$f":"RegistroTotal!AE14","v":0},null,"Muy Bajo",null,35.25,3.5250000000000004,5.2874999999999996,7.0500000000000007,10.574999999999999]
[null,null,null,null,null,null,null,null,null,"Económicos",null,{"$f":"\"  \"&Impactos!C20","v":"  Optimización de la inversión pública "},null,null,null,null,null,null,null,null,{"$f":"RegistroTotal!AF14","v":0},null,"Muy Bajo",null,30.75,3.0750000000000002,4.6124999999999998,6.15,9.2249999999999996]
[null,null,null,null,null,null,null,null,null,null,null,{"$f":"\"  \"&Impactos!C21","v":"  Atracción para negocios, turismo y economía verde"},null,null,null,null,null,null,null,null,{"$f":"RegistroTotal!AG14","v":0},null,"Muy Bajo",null,40.75,4.0750000000000002,6.1124999999999998,8.15,12.225]
[]
[null,null,null,null,null,null,null,null,null,null,null,null,null,null,null,17]
[]
[null,null,null,null,null,null,null,null,null,null,null,null,null,null,null,18]

{"sheet":"Resumen Resultados","index":26,"n_rows":60,"n_cols":24,"rows_kept":60,"cut":false,"hidden":true,"merged":[[36,10,36,18],[52,7,52,8],[35,2,35,6],[36,2,36,6],[37,2,37,6],[38,2,38,6],[26,2,26,6],[25,8,26,9],[26,19,26,20],[27,19,27,20],[28,19,28,20],[35,19,35,20],[36,19,36,20],[37,19,37,20],[37,10,37,18],[38,10,38,18],[27,10,27,18],[28,10,28,18],[26,10,26,18],[38,8,39,9],[27,2,27,6],[28,2,28,6],[29,2,29,6],[32,2,32,6],[35,10,35,18],[29,19,29,20],[30,19,30,20],[31,19,31,20],[32,19,32,20],[30,10,30,18],[31,10,31,18],[32,10,32,18],[33,10,33,18],[34,10,34,18],[33,19,33,20],[34,19,34,20],[29,10,29,18],[63,2,63,6],[63,7,63,8],[64,2,64,6],[64,7,64,8],[65,2,65,6],[65,7,65,8],[39,10,39,18],[38,19,38,20],[39,19,39,20],[58,2,58,6],[58,7,58,8],[59,2,59,6],[60,2,60,6],[60,7,60,8],[61,2,61,6],[61,7,61,8],[62,2,62,6],[62,7,62,8],[53,2,53,6],[53,7,53,8],[54,2,54,6],[54,7,54,8],[55,2,55,6],[55,7,55,8],[56,8,57,9],[56,2,56,6],[57,2,57,6],[6,1,6,19],[6,20,6,22],[25,2,25,6],[20,19,20,20],[21,19,21,20],[22,19,22,20],[23,19,23,20],[24,19,24,20],[25,19,25,20],[20,2,20,6],[21,2,21,6],[22,2,22,6],[23,2,23,6],[24,2,24,6],[20,8,24,9],[9,1,9,3],[11,1,11,3],[9,9,11,22],[14,1,14,3],[23,10,23,18],[24,10,24,18],[9,6,11,8],[45,10,45,17],[42,8,43,22],[17,8,18,22],[17,1,18,6],[21,21,21,22],[22,21,22,22],[23,21,23,22],[24,21,24,22],[25,21,25,22],[26,21,26,22],[27,21,27,22],[14,6,14,8],[14,9,14,11],[15,6,15,8],[15,9,15,11],[39,2,39,6],[30,2,30,6],[31,2,31,6],[40,2,40,6],[40,7,40,8],[41,2,41,6],[42,2,42,6],[43,2,43,6],[14,14,14,16],[14,17,14,19],[56,10,57,17],[56,18,57,18],[28,21,28,22],[29,21,29,22],[47,10,47,17],[39,21,39,22],[45,8,45,9],[30,21,30,22],[31,21,31,22],[32,21,32,22],[33,21,33,22],[34,21,34,22],[35,21,35,22],[36,21,36,22],[37,21,37,22],[38,21,38,22],[33,8,37,9],[20,21,20,22],[25,10,25,18],[20,10,20,18],[21,10,21,18],[22,10,22,18],[2,1,2,22],[33,2,33,6],[34,2,34,6],[27,8,32,9],[59,10,60,17],[59,18,60,18],[45,19,45,22],[47,19,47,22],[56,19,57,22],[59,19,60,22],[44,2,44,6],[45,2,45,6],[46,2,46,6],[47,2,47,6],[47,7,47,8],[48,2,48,6],[48,7,48,8],[49,2,49,6],[49,7,49,8],[50,2,50,6],[50,7,50,8],[51,2,51,6],[51,7,51,8],[52,2,52,6]]}
[]
[]
[null,"Herramienta para la estimación y la evaluación de los impactos de la infraestructura verde"]
[]
[]
[]
[null,"    Resumen de resultados",null,null,null,null,null,null,null,null,null,null,null,null,null,null,null,null,null,null,"Guardar"]
[]
[]
[null,{"$f":"'4. Impactos-Resultados'!B17","v":"    Clave del Proyecto"},null,null,{"$f":"RegistroTotal!C2","v":0},null,{"$f":"'1c. Registrar datos proyecto'!N17","v":"Nombre del Proyecto"},null,null,{"$f":"'1c. Registrar datos proyecto'!R17","v":0}]
[]
[null,{"$f":"'4. Impactos-Resultados'!B19","v":"    Año de ejecución"},null,null,{"$f":"RegistroTotal!F3","v":0}]
[]
[]
[null,"Presupuesto total",null,null,{"$f":"RegistroTotal!I5","v":0},{"$f":"RegistroTotal!I8","v":0},"Estado ",null,null,{"$f":"'1c. Registrar datos proyecto'!H18","v":0},null,null,null,null,"Población beneficiaria",null,null,{"$f":"'1c. Registrar datos proyecto'!H25","v":0}]
[null,"% Infraestructura verde",null,null,{"$f":"IF(ISERROR(RegistroTotal!I8/RegistroTotal!I7),0,RegistroTotal!I8/RegistroTotal!I7)","v":0},null,"Municipio",null,null,{"$f":"'1c. Registrar datos proyecto'!H19","v":0}]
[]
[null,"Listado de componentes de Infraestructura Verde",null,null,null,null,null,null,"Mapa de impactos "]
[]
[]
[null,{"$f":"'4. Impactos-Resultados'!B55","v":0},{"$f":"'4. Impactos-Resultados'!C55","v":0},null,null,null,null,null,"Adaptación",null,{"$f":"'4. Impactos-Resultados'!L55","v":"  Prevención de inundaciones, regulación de escorrentías"},null,null,null,null,null,null,null,null,{"$f":"'4. Impactos-Resultados'!U55","v":0},null,{"$f":"'4. Impactos-Resultados'!W55","v":"Muy Bajo"},null,{"$f":"'4. Impactos-Resultados'!Y55","v":40.25}]
[null,{"$f":"'4. Impactos-Resultados'!B56","v":0},{"$f":"'4. Impactos-Resultados'!C56","v":0},null,null,null,null,null,null,null,{"$f":"'4. Impactos-Resultados'!L56","v":"  Reducción de los riesgos derivados de las inundaciones, regulación de avenidas."},null,null,null,null,null,null,null,null,{"$f":"'4. Impactos-Resultados'!U56","v":0},null,{"$f":"'4. Impactos-Resultados'!W56","v":"Muy Bajo"},null,{"$f":"'4. Impactos-Resultados'!Y56","v":36.5}]
[null,{"$f":"'4. Impactos-Resultados'!B57","v":0},{"$f":"'4. Impactos-Resultados'!C57","v":0},null,null,null,null,null,null,null,{"$f":"'4. Impactos-Resultados'!L57","v":"  Incremento de la recarga de agua de los acuíferos"},null,null,null,null,null,null,null,null,{"$f":"'4. Impactos-Resultados'!U57","v":0},null,{"$f":"'4. Impactos-Resultados'!W57","v":"Muy Bajo"},null,{"$f":"'4. Impactos-Resultados'!Y57","v":39}]
[null,{"$f":"'4. Impactos-Resultados'!B58","v":0},{"$f":"'4. Impactos-Resultados'!C58","v":0},null,null,null,null,null,null,null,{"$f":"'4. Impactos-Resultados'!L58","v":"  Regulación térmica y disminución de las islas urbanas de calor"},null,null,null,null,null,null,null,null,{"$f":"'4. Impactos-Resultados'!U58","v":0},null,{"$f":"'4. Impactos-Resultados'!W58","v":"Muy Bajo"},null,{"$f":"'4. Impactos-Resultados'!Y58","v":35.25}]
[null,{"$f":"'4. Impactos-Resultados'!B59","v":0},{"$f":"'4. Impactos-Resultados'!C59","v":0},null,null,null,null,null,null,null,{"$f":"'4. Impactos-Resultados'!L59","v":"  Mejora de la conectividad ecológica."},null,null,null,null,null,null,null,null,{"$f":"'4. Impactos-Resultados'!U59","v":0},null,{"$f":"'4. Impactos-Resultados'!W59","v":"Muy Bajo"},null,{"$f":"'4. Impactos-Resultados'!Y59","v":33.25}]
[null,{"$f":"'4. Impactos-Resultados'!B60","v":0},{"$f":"'4. Impactos-Resultados'!C60","v":0},null,null,null,null,null,"Mitigación",null,{"$f":"'4. Impactos-Resultados'!L60","v":"  Secuestro de carbono "},null,null,null,null,null,null,null,null,{"$f":"'4. Impactos-Resultados'!U60","v":0},null,{"$f":"'4. Impactos-Resultados'!W60","v":"Muy Bajo"},null,{"$f":"'4. Impactos-Resultados'!Y60","v":26.75}]
[null,{"$f":"'4. Impactos-Resultados'!B61","v":0},{"$f":"'4. Impactos-Resultados'!C61","v":0},null,null,null,null,null,null,null,{"$f":"'4. Impactos-Resultados'!L61","v":"  Reducción de emisiones de GEI"},null,null,null,null,null,null,null,null,{"$f":"'4. Impactos-Resultados'!U61","v":0},null,{"$f":"'4. Impactos-Resultados'!W61","v":"Muy Bajo"},null,{"$f":"'4. Impactos-Resultados'!Y61","v":25.25}]
[null,{"$f":"'4. Impactos-Resultados'!B62","v":0},{"$f":"'4. Impactos-Resultados'!C62","v":0},null,null,null,null,null,"Ambientales",null,{"$f":"'4. Impactos-Resultados'!L62","v":"  Mejora de la calidad del aire"},null,null,null,null,null,null,null,null,{"$f":"'4. Impactos-Resultados'!U62","v":0},null,{"$f":"'4. Impactos-Resultados'!W62","v":"Muy Bajo"},null,{"$f":"'4. Impactos-Resultados'!Y62","v":29.25}]
[null,{"$f":"'4. Impactos-Resultados'!B63","v":0},{"$f":"'4. Impactos-Resultados'!C63","v":0},null,null,null,null,null,null,null,{"$f":"'4. Impactos-Resultados'!L63","v":"  Mejora de la calidad del agua (purificación del agua)"},null,null,null,null,null,null,null,null,{"$f":"'4. Impactos-Resultados'!U63","v":0},null,{"$f":"'4. Impactos-Resultados'!W63","v":"Muy Bajo"},null,{"$f":"'4. Impactos-Resultados'!Y63","v":35.25}]
[null,{"$f":"'4. Impactos-Resultados'!B64","v":0},{"$f":"'4. Impactos-Resultados'!C64","v":0},null,null,null,null,null,null,null,{"$f":"'4. Impactos-Resultados'!L64","v":"  Reducción de la contaminación por ruido"},null,null,null,null,null,null,null,null,{"$f":"'4. Impactos-Resultados'!U64","v":0},null,{"$f":"'4. Impactos-Resultados'!W64","v":"Muy Bajo"},null,{"$f":"'4. Impactos-Resultados'!Y64","v":29.5}]
[null,{"$f":"'4. Impactos-Resultados'!B65","v":0},{"$f":"'4. Impactos-Resultados'!C65","v":0},null,null,null,null,null,null,null,{"$f":"'4. Impactos-Resultados'!L65","v":"  Control de la erosión del suelo"},null,null,null,null,null,null,null,null,{"$f":"'4. Impactos-Resultados'!U65","v":0},null,{"$f":"'4. Impactos-Resultados'!W65","v":"Muy Bajo"},null,{"$f":"'4. Impactos-Resultados'!Y65","v":27.75}]
[null,{"$f":"'4. Impactos-Resultados'!B66","v":0},{"$f":"'4. Impactos-Resultados'!C66","v":0},null,null,null,null,null,null,null,{"$f":"'4. Impactos-Resultados'!L66","v":"  Mantenimiento, protección y mejora de hábitats, vida silvestre y biodiversidad"},null,null,null,null,null,null,null,null,{"$f":"'4. Impactos-Resultados'!U66","v":0},null,{"$f":"'4. Impactos-Resultados'!W66","v":"Muy Bajo"},null,{"$f":"'4. Impactos-Resultados'!Y66","v":32.25}]
[null,{"$f":"'4. Impactos-Resultados'!B67","v":0},{"$f":"'4. Impactos-Resultados'!C67","v":0},null,null,null,null,null,null,null,{"$f":"'4. Impactos-Resultados'!L67","v":"  Producción de servicios ecosistémicos"},null,null,null,null,null,null,null,null,{"$f":"'4. Impactos-Resultados'!U67","v":0},null,{"$f":"'4. Impactos-Resultados'!W67","v":"Muy Bajo"},null,{"$f":"'4. Impactos-Resultados'!Y67","v":31.25}]
[null,{"$f":"'4. Impactos-Resultados'!B68","v":0},{"$f":"'4. Impactos-Resultados'!C68","v":0},null,null,null,null,null,"Sociales",null,{"$f":"'4. Impactos-Resultados'!L68","v":"  Mejora de los valores estéticos"},null,null,null,null,null,null,null,null,{"$f":"'4. Impactos-Resultados'!U68","v":0},null,{"$f":"'4. Impactos-Resultados'!W68","v":"Muy Bajo"},null,{"$f":"'4. Impactos-Resultados'!Y68","v":49.5}]
[null,{"$f":"'4. Impactos-Resultados'!B69","v":0},{"$f":"'4. Impactos-Resultados'!C69","v":0},null,null,null,null,null,null,null,{"$f":"'4. Impactos-Resultados'!L69","v":"  Mejora accesibilidad de recursos para deporte, cultura, formación y recreación"},null,null,null,null,null,null,null,null,{"$f":"'4. Impactos-Resultados'!U69","v":0},null,{"$f":"'4. Impactos-Resultados'!W69","v":"Muy Bajo"},null,{"$f":"'4. Impactos-Resultados'!Y69","v":38}]
[null,{"$f":"'4. Impactos-Resultados'!B70","v":0},{"$f":"'4. Impactos-Resultados'!C70","v":0},null,null,null,null,null,null,null,{"$f":"'4. Impactos-Resultados'!L70","v":"  Mejora de la salud y bienestar"},null,null,null,null,null,null,null,null,{"$f":"'4. Impactos-Resultados'!U70","v":0},null,{"$f":"'4. Impactos-Resultados'!W70","v":"Muy Bajo"},null,{"$f":"'4. Impactos-Resultados'!Y70","v":29.25}]
[null,{"$f":"'4. Impactos-Resultados'!B71","v":0},{"$f":"'4. Impactos-Resultados'!C71","v":0},null,null,null,null,null,null,null,{"$f":"'4. Impactos-Resultados'!L71","v":"  Generación de recursos comunitarios (fortalecimiento de la ciudadanía)"},null,null,null,null,null,null,null,null,{"$f":"'4. Impactos-Resultados'!U71","v":0},null,{"$f":"'4. Impactos-Resultados'!W71","v":"Muy Bajo"},null,{"$f":"'4. Impactos-Resultados'!Y71","v":39.25}]
[null,{"$f":"'4. Impactos-Resultados'!B72","v":0},{"$f":"'4. Impactos-Resultados'!C72","v":0},null,null,null,null,null,null,null,{"$f":"'4. Impactos-Resultados'!L72","v":"  Fortalecimiento de sentimiento de pertenencia e identidad"},null,null,null,null,null,null,null,null,{"$f":"'4. Impactos-Resultados'!U72","v":0},null,{"$f":"'4. Impactos-Resultados'!W72","v":"Muy Bajo"},null,{"$f":"'4. Impactos-Resultados'!Y72","v":35.25}]
[null,{"$f":"'4. Impactos-Resultados'!B73","v":0},{"$f":"'4. Impactos-Resultados'!C73","v":0},null,null,null,null,null,"Económicos",null,{"$f":"'4. Impactos-Resultados'!L73","v":"  Optimización de la inversión pública "},null,null,null,null,null,null,null,null,{"$f":"'4. Impactos-Resultados'!U73","v":0},null,{"$f":"'4. Impactos-Resultados'!W73","v":"Muy Bajo"},null,{"$f":"'4. Impactos-Resultados'!Y73","v":30.75}]
[null,{"$f":"'4. Impactos-Resultados'!B74","v":0},{"$f":"'4. Impactos-Resultados'!C74","v":0},null,null,null,null,null,null,null,{"$f":"'4. Impactos-Resultados'!L74","v":"  Atracción para negocios, turismo y economía verde"},null,null,null,null,null,null,null,null,{"$f":"'4. Impactos-Resultados'!U74","v":0},null,{"$f":"'4. Impactos-Resultados'!W74","v":"Muy Bajo"},null,{"$f":"'4. Impactos-Resultados'!Y74","v":40.75}]
[null,{"$f":"'4. Impactos-Resultados'!B75","v":0},{"$f":"'4. Impactos-Resultados'!C75","v":0}]
[null,{"$f":"'4. Impactos-Resultados'!B76","v":0},{"$f":"'4. Impactos-Resultados'!C76","v":0}]
[null,{"$f":"'4. Impactos-Resultados'!B77","v":0},{"$f":"'4. Impactos-Resultados'!C77","v":0},null,null,null,null,null,"Evaluación de impactos"]
[null,{"$f":"'4. Impactos-Resultados'!B78","v":0},{"$f":"'4. Impactos-Resultados'!C78","v":0}]
[null,{"$f":"'4. Impactos-Resultados'!B79","v":0},{"$f":"'4. Impactos-Resultados'!C79","v":0}]
[null,null,null,null,null,null,null,null,"Mitigación ",null,{"$f":"K26","v":"  Secuestro de carbono "},null,null,null,null,null,null,null,{"$f":"RegistroDatos!F77","v":0},{"$f":"RegistroDatos!G77","v":"toneladas CO2 / año"}]
[]
[null,null,null,null,null,null,null,null,null,null,{"$f":"K27","v":"  Reducción de emisiones de GEI"},null,null,null,null,null,null,null,{"$f":"L50+L52+L54","v":0},"toneladas CO2e/año"]
[]
[null,null,null,null,null,null,null,null,null,null,null,{"$f":"RegistroDatos!F17","v":0},{"$f":"RegistroDatos!G17","v":"tCO2e"},"Emisiones reducidas al año por iluminación eficiente"]
[]
[null,null,null,null,null,null,null,null,null,null,null,{"$f":"+RegistroDatos!F34","v":0},{"$f":"RegistroDatos!G34","v":"tCO2e"},"Emisiones reducidas por iluminación con energía renovable"]
[]
[null,null,null,null,null,null,null,null,null,null,null,{"$f":"RegistroDatos!F68","v":0},{"$f":"RegistroDatos!G68","v":"tCo2e"},"Emisiones reducidas por la instalación de biodigestor"]
[]
[]
[null,null,null,null,null,null,null,null,"Ambiental",null,{"$f":"K28","v":"  Mejora de la calidad del aire"},null,null,null,null,null,null,null,{"$f":"RegistroDatos!F74","v":0},{"$f":"RegistroDatos!G74","v":"gramos contaminación aire"}]
[]
[]
[null,null,null,null,null,null,null,null,null,null,{"$f":"K31","v":"  Control de la erosión del suelo"},null,null,null,null,null,null,null,{"$f":"RegistroDatos!F78","v":0},{"$f":"RegistroDatos!G78","v":"Escurrimiento evitado m3/año"}]

{"sheet":"Datos","index":27,"n_rows":574,"n_cols":43,"rows_kept":574,"cut":false,"hidden":true,"merged":[]}
[]
[null,null,"û"]
[null,null,"ü"]
[null,"Modalidad PMU-Vertiente Mejoramiento Integral de Barrios","Situación antes del proyecto","Elemento de IV asociados al agua presentes en el proyecto","Elemento de IV asociados a la biodiversidad presentes en el proyecto","Elemento de IV asociados al espacio público presentes en el proyecto","Elemento de IV asociados a la movilidad presentes en el proyecto","Estados","Aguascalientes","Baja California","Baja California Sur","Campeche","Chiapas","Chihuahua","Ciudad de México","Coahuila de Zaragoza","Colima","Durango","Guanajuato","Guerrero","Hidalgo","Jalisco","Estado de México","Michoacán de Ocampo","Morelos","Nayarit","Nuevo León","Oaxaca","Puebla","Querétaro","Quintana Roo","San Luis Potosí","Sinaloa","Sonora","Tabasco","Tamaulipas","Tlaxcala","Veracruz de Ignacio de la Llave","Yucatán","Zacatecas","Año","Modalidad","Clima"]
[null,"a. Equipamiento urbano y espacio público","Lote baldío","BIODIGESTORES","ARBOLADO","MOBILIARIO URBANO SOSTENIBLE","CICLOVIAS","Aguascalientes","Aguascalientes","Ensenada","Comondú","Calakmul","Acacoyagua","Ahumada","Álvaro Obregón","Abasolo","Armería","Canatlán","Abasolo","Acapulco de Juárez","Acatlán","Acatic","Acambay de Ruíz Castañeda","Acuitzio","Amacuzac","Acaponeta","Abasolo","Abejones","Acajete","Amealco de Bonfil","Bacalar","Ahualulco","Ahome","Aconchi","Balancán","Abasolo","Acuamanala de Miguel Hidalgo","Acajete","Abalá","Apozol",2019,"Diseño urbano y servicios relacionados con la obra","Cálido húmero"]
[null,"b. Participación comunitaria","Lote semiocupado pero en desuso","CISTERNAS/PRESAS FILTRANTES","ARBOLADO URBANO NATIVO","MOBILIARIO HIDRÁULICO CERTIFICADO","CORREDOR PEATONAL ARBOLADO","Baja California","Asientos","Mexicali","La Paz","Calkiní","Acala","Aldama","Azcapotzalco","Acuña","Colima","Canelas","Acámbaro","Acatepec","Acaxochitlán","Acatlán de Juárez","Acolman","Aguililla","Atlatlahucan","Ahuacatlán","Agualeguas","Acatlán de Pérez Figueroa","Acateno","Arroyo Seco","Benito Juárez","Alaquines","Angostura","Agua Prieta","Cárdenas","Aldama","Amaxac de Guerrero","Acatlán","Acanceh","Apulco",2020,"Equipamiento urbano y espacio público","Templado"]
[null,"c. Movilidad y conectividad","Lote con uso de suelo urbano (H, C, I, S, M)","CUNETAS VERDES","BOSQUE URBANO","LUMINARIAS","CINTURÓN VERDE","Baja California Sur","Clavillo","Playas de Rosarito","Loreto","Campeche","Acapetahua","Allende","Benito Juárez","Allende","Comala","Coneto de Comonfort","Apaseo el Alto","Ahuacuotzingo","Actopan","Ahualulco de Mercado","Aculco","Álvaro Obregón","Axochiapan","Amatlán de Cañas","Allende","Ánimas Trujano","Acatlán","Cadereyta de Montes","Cozumel","Aquismón","Badiraguato","Alamos","Centla","Altamira","Apetatitlán de Antonio Carvajal","Acayucan","Akil","Atolinga",2021,"Infraestructura urbana","Cálido seco"]
[null,"d. Infraestructura urbana","Lote con uso de suelo no urbano","DRENAJE SEPARATIVO","JARDINES EDUCATIVOS","LUMINARIAS CON PANELES SOLARES","URBANISMO TÁCTICO","Campeche","Cosío","San Quintín","Los Cabos","Candelaria","Aldama","Aquiles Serdán","Coyoacán","Arteaga","Coquimatlán","Cuencamé","Apaseo el Grande","Ajuchitlán del Progreso","Agua Blanca de Iturbide","Amacueca","Almoloya de Alquisiras","Angamacutiro","Ayala","Bahía de Banderas","Anáhuac","Asunción Cacalotepec","Acatzingo","Colón","Felipe Carrillo Puerto","Armadillo de los Infante","Choix","Altar","Centro","Antiguo Morelos","Apizaco","Actopan","Baca","Benito Juárez",null,"Movilidad y conectividad"]
[null,"e. Diseño urbano y servicios relacionados con la obra","Area Natural Protegida","HUMEDAL SEMIARTIFICIAL","JARDINES Y HUERTOS COMUNITARIOS","AREAS INFILTRANTES MULTIPROPOSITO","BANQUETAS","Chiapas","El Llano ","Tecate","Mulegé","Carmen","Altamirano","Ascensión","Cuajimalpa de Morelos","Candela","Cuauhtémoc","Durango","Atarjea","Alcozauca de Guerrero","Ajacuba","Amatitán","Almoloya de Juárez","Angangueo","Coatetelco","Compostela","Apodaca","Asunción Cuyotepeji","Acteopan","Corregidora","Isla Mujeres","Axtla de Terrazas","Concordia","Arivechi","Comalcalco","Burgos","Atlangatepec","Acula","Bokobá","Calera",null,"Participación comunitaria"]
[null,null,"Relleno sanitario","PAVIMENTOS PERMEABLES","RENATURALIZACION DE ELEMENTOS FLUVIALES","JARDIN LLUVIA","ZONA TRANSPORTE PÚBLICO","Chihuahua","Jesús María","Tijuana",null,"Champotón","Amatán","Bachíniva","Cuauhtémoc","Castaños","Ixtlahuacán","El Oro","Celaya","Alpoyeca","Alfajayucan","Ameca","Almoloya del Río","Apatzingán","Coatlán del Río","Del Nayar","Aramberri","Asunción Ixtaltepec","Ahuacatlán","El Marqués","José María Morelos","Cárdenas","Cosalá","Arizpe","Cunduacán","Bustamante","Atltzayanca","Acultzingo","Buctzotz","Cañitas de Felipe Pescador"]
[null,null,"Tiradero a cielo abierto","POZOS DE ABSORCIÓN","DESENTUBADO DE RIOS","PAVIMENTOS RECICLADOS","ZONA CARGA SOSTENIBLE","Ciudad de México","Pabellón de Arteaga",null,null,"Escárcega","Amatenango de la Frontera","Balleza","Gustavo A. Madero","Cuatro Ciénegas","Manzanillo","General Simón Bolívar","Comonfort","Apaxtla","Almoloya","Arandas","Amanalco","Aporo","Cuautla","Huajicori","Bustamante","Asunción Nochixtlán","Ahuatlán","Ezequiel Montes","Lázaro Cárdenas","Catorce","Culiacán","Atil","Emiliano Zapata","Camargo","Benito Juárez","Agua Dulce","Cacalchén","Chalchihuites"]
[null,null,"Otro","PTAR",null,"ELEMENTOS DE SOMBREAMIENTO","ZONA VEHÍCULO PRIVADO SOSTENIBLE","Coahuila","Rincón de los Romos",null,null,"Hecelchakán","Amatenango del Valle","Batopilas de Manuel Gómez Morín","Iztacalco","Escobedo","Minatitlán","Gómez Palacio","Coroneo","Arcelia","Apan","Atemajac de Brizuela","Amatepec","Aquila","Cuernavaca","Ixtlán del Río","Cadereyta Jiménez","Asunción Ocotlán","Ahuazotepec","Huimilpan","Othón P. Blanco","Cedral","El Fuerte","Bacadéhuachi","Huimanguillo","Casas","Calpulalpan","Álamo Temapache","Calotmul","Concepción del Oro"]
[null,null,null,"SUDS/ JARDINERAS, ZANJAS Y/O POZOS INFILTRACION",null,null,null,"Colima","San Francisco de los Romo",null,null,"Hopelchén","Ángel Albino Corzo","Bocoyna","Iztapalapa","Francisco I. Madero","Tecomán","Guadalupe Victoria","Cortazar","Atenango del Río","Atitalaquia","Atengo","Amecameca","Ario","Emiliano Zapata","Jala","Cerralvo","Asunción Tlacolulita","Ahuehuetitla","Jalpan de Serra","Puerto Morelos","Cerritos","Elota","Bacanora","Jalapa","Ciudad Madero","Chiautempan","Alpatláhuac","Cansahcab","Cuauhtémoc"]
[null,null,null,null,null,null,null,"Durango","San José de Gracias",null,null,"Palizada","Arriaga","Buenaventura","Magdalena Contreras","Frontera","Villa de Álvarez","Guanaceví","Cuerámaro","Atlamajalcingo del Monte","Atlapexco","Atenguillo","Apaxco","Arteaga","Hueyapan","La Yesca","China","Ayoquezco de Aldama","Ajalpan","Landa de Matamoros","Solidaridad","Cerro de San Pedro","Escuinapa","Bacerac","Jalpa de Méndez","Cruillas","Contla de Juan Cuamatzi","Alto Lucero de Gutiérrez Barrios","Cantamayec","El Plateado de Joaquín Amaro"]
[null,null,null,null,null,null,null,"Guanajuato","Tepezala",null,null,"Seyba","Bejucal de Ocampo","Camargo","Miguel Hidalgo","General Cepeda",null,"Hidalgo","Doctor Mora","Atlixtac","Atotonilco de Tula","Atotonilco el Alto","Atenco","Briseñas","Huitzilac","Rosamorada","Ciénega de Flores","Ayotzintepec","Albino Zertuche","Pedro Escobedo","Tulum","Charcas","Guasave","Bacoachi","Jonuta","El Mante","Cuapiaxtla","Altotonga","Celestún","El Salvador"]
[null,null,null,null,null,null,null,"Guerrero",null,null,null,"Tenabo","Bella Vista","Carichí","Milpa Alta","Guerrero",null,"Indé","Dolores Hidalgo Cuna de la Independencia Nacional","Atoyac de Álvarez","Atotonilco el Grande","Atoyac","Atizapán","Buenavista","Jantetelco","Ruíz","Doctor Arroyo","Calihualá","Aljojuca","Peñamiller",null,"Ciudad del Maíz","Mazatlán","Bácum","Macuspana","Gómez Farías","Cuaxomulco","Alvarado","Cenotillo","Fresnillo"]
[null,null,null,null,null,null,null,"Hidalgo",null,null,null,null,"Benemérito de las Américas","Casas Grandes","Tláhuac","Hidalgo",null,"Lerdo","Guanajuato","Ayutla de los Libres","Calnali","Autlán de Navarro","Atizapán de Zaragoza","Carácuaro","Jiutepec","San Blas","Doctor Coss","Candelaria Loxicha","Altepexi","Pinal de Amoles",null,"Ciudad Fernández","Mocorito","Banámichi","Nacajuca","González","El Carmen Tequexquitla","Amatitlán","Chacsinkín","Genaro Codina"]
[null,null,null,null,null,null,null,"Jalisco",null,null,null,null,"Berriozábal","Chihuahua","Tlalpan","Jiménez",null,"Mapimí","Huanímaro","Azoyú","Cardonal","Ayotlán","Atlacomulco","Charapan","Jojutla","San Pedro Lagunillas","Doctor González","Capulálpam de Méndez","Amixtlán","Querétaro",null,"Ciudad Valles","Navolato","Baviácora","Paraíso","Güémez","Emiliano Zapata","Amatlán de los Reyes","Chankom","General Enrique Estrada"]
[null,null,null,null,null,null,null,"Estado de México",null,null,null,null,"Bochil","Chínipas","Venustiano Carranza","Juárez",null,"Mezquital","Irapuato","Benito Juárez","Chapantongo","Ayutla","Atlautla","Charo","Jonacatepec de Leandro Valle","Santa María del Oro","El Carmen","Chahuites","Amozoc","San Joaquín",null,"Coxcatlán","Rosario","Bavispe","Tacotalpa","Guerrero","Españita","Angel R. Cabada","Chapab","General Francisco R. Murguía"]
[null,null,null,null,null,null,null,"Michoacán de Ocampo",null,null,null,null,"Cacahoatán","Coronado","Xochimilco","Lamadrid",null,"Nazas","Jaral del Progreso","Buenavista de Cuéllar","Chapulhuacán","Bolaños","Axapusco","Chavinda","Mazatepec","Santiago Ixcuintla","Galeana","Chalcatongo de Hidalgo","Aquixtla","San Juan del Río",null,"Ebano","Salvador Alvarado","Benito Juárez","Teapa","Gustavo Díaz Ordaz","Huamantla","Apazapan","Chemax","General Pánfilo Natera"]
[null,null,null,null,null,null,null,"Morelos",null,null,null,null,"Capitán Luis Ángel Vidal","Coyame del Sotol",null,"Matamoros",null,"Nombre de Dios","Jerécuaro","Chilapa de Álvarez","Chilcuautla","Cabo Corrientes","Ayapango","Cherán","Miacatlán","Tecuala","García","Chiquihuitlán de Benito Juárez","Atempan","Tequisquiapan",null,"El Naranjo","San Ignacio","Benjamín Hill","Tenosique","Hidalgo","Hueyotlipan","Aquila","Chichimilá","Guadalupe"]
[null,null,null,null,null,null,null,"Nayarit",null,null,null,null,"Catazajá","Cuauhtémoc",null,"Monclova",null,"Nuevo Ideal","León","Chilpancingo de los Bravo","Cuautepec de Hinojosa","Cañadas de Obregón","Calimaya","Chilchota","Ocuituco","Tepic","General Bravo","Ciénega de Zimatlán","Atexcal","Tolimán",null,"Guadalcázar","Sinaloa","Caborca",null,"Jaumave","Ixtacuixtla de Mariano Matamoros","Astacinga","Chicxulub Pueblo","Huanusco"]
[null,null,null,null,null,null,null,"Nuevo León",null,null,null,null,"Chalchihuitán","Cusihuiriachi",null,"Morelos",null,"Ocampo","Manuel Doblado","Coahuayutla de José María Izazaga","El Arenal","Casimiro Castillo","Capulhuac","Chinicuila","Puente de Ixtla","Tuxpan","General Escobedo","Ciudad Ixtepec","Atlequizayan",null,null,"Huehuetlán",null,"Cajeme",null,"Jiménez","Ixtenco","Atlahuilco","Chikindzonot","Jalpa"]
[null,null,null,null,null,null,null,"Oaxaca",null,null,null,null,"Chamula","Delicias",null,"Múzquiz",null,"Otáez","Moroleón","Cochoapa el Grande","Eloxochitlán","Chapala","Chalco","Chucándiro","Temixco","Xalisco","General Terán","Coatecas Altas","Atlixco",null,null,"Lagunillas",null,"Cananea",null,"Llera","La Magdalena Tlaltelulco","Atoyac","Chocholá","Jerez"]
[null,null,null,null,null,null,null,"Puebla",null,null,null,null,"Chanal","Dr. Belisario Domínguez",null,"Nadadores",null,"Pánuco de Coronado","Ocampo","Cocula","Emiliano Zapata","Chimaltitán","Chapa de Mota","Churintzio","Temoac",null,"General Treviño","Coicoyán de las Flores","Atoyatempan",null,null,"Matehuala",null,"Carbó",null,"Mainero","Lázaro Cárdenas","Atzacan","Chumayel","Jiménez del Teul"]
[null,null,null,null,null,null,null,"Querétaro",null,null,null,null,"Chapultenango","El Tule",null,"Nava",null,"Peñón Blanco","Pénjamo","Copala","Epazoyucan","Chiquilistlán","Chapultepec","Churumuco","Tepalcingo",null,"General Zaragoza","Concepción Buenavista","Atzala",null,null,"Matlapa",null,"Cucurpe",null,"Matamoros","Mazatecochco de José María Morelos","Atzalan","Conkal","Juan Aldama"]
[null,null,null,null,null,null,null,"Quintana Roo",null,null,null,null,"Chenalhó","Galeana",null,"Ocampo",null,"Poanas","Pueblo Nuevo","Copalillo","Francisco I. Madero","Cihuatlán","Chiautla","Coahuayana","Tepoztlán",null,"General Zuazua","Concepción Pápalo","Atzitzihuacán",null,null,"Mexquitic de Carmona",null,"Cumpas",null,"Méndez","Muñoz de Domingo Arenas","Ayahualulco","Cuncunul","Juchipila"]
[null,null,null,null,null,null,null,"San Luis Potosí",null,null,null,null,"Chiapa de Corzo","Gómez Farías",null,"Parras",null,"Pueblo Nuevo","Purísima del Rincón","Copanatoyac","Huasca de Ocampo","Cocula","Chicoloapan","Coalcomán de Vázquez Pallares","Tetecala",null,"Guadalupe","Constancia del Rosario","Atzitzintla",null,null,"Moctezuma",null,"Divisaderos",null,"Mier","Nanacamilpa de Mariano Arista","Banderilla","Cuzamá","Loreto"]
[null,null,null,null,null,null,null,"Sinaloa",null,null,null,null,"Chiapilla","Gran Morelos",null,"Piedras Negras",null,"Rodeo","Romita","Coyuca de Benítez","Huautla","Colotlán","Chiconcuac","Coeneo","Tetela del Volcán",null,"Hidalgo","Cosolapa","Axutla",null,null,"Rayón",null,"Empalme",null,"Miguel Alemán","Natívitas","Benito Juárez","Dzán","Luis Moya"]
[null,null,null,null,null,null,null,"Sonora",null,null,null,null,"Chicoasén","Guachochi",null,"Progreso",null,"San Bernardo","Salamanca","Coyuca de Catalán","Huazalingo","Concepción de Buenos Aires","Chimalhuacán","Cojumatlán de Régules","Tlalnepantla",null,"Higueras","Cosoltepec","Ayotoxco de Guerrero",null,null,"Rioverde",null,"Etchojoa",null,"Miquihuana","Panotla","Boca del Río","Dzemul","Mazapil"]
[null,null,null,null,null,null,null,"Tabasco",null,null,null,null,"Chicomuselo","Guadalupe",null,"Ramos Arizpe",null,"San Dimas","Salvatierra","Cuajinicuilapa","Huehuetla","Cuautitlán de García Barragán","Coacalco de Berriozábal","Contepec","Tlaltizapán de Zapata",null,"Hualahuises","Cuilápam de Guerrero","Calpan",null,null,"Salinas",null,"Fronteras",null,"Nuevo Laredo","Papalotla de Xicohténcatl","Calcahualco","Dzidzantún","Melchor Ocampo"]
[null,null,null,null,null,null,null,"Tamaulipas",null,null,null,null,"Chilón","Guadalupe y Calvo",null,"Sabinas",null,"San Juan de Guadalupe","San Diego de la Unión","Cualác","Huejutla de Reyes","Cuautla","Coatepec Harinas","Copándaro","Tlaquiltenango",null,"Iturbide","Cuyamecalco Villa de Zaragoza","Caltepec",null,null,"San Antonio",null,"General Plutarco Elías Calles",null,"Nuevo Morelos","San Damián Texóloc","Camarón de Tejeda","Dzilam de Bravo","Mezquital del Oro"]
[null,null,null,null,null,null,null,"Tlaxcala",null,null,null,null,"Cintalapa","Guazapares",null,"Sacramento",null,"San Juan del Río","San Felipe","Cuautepec","Huichapan","Cuquío","Cocotitlán","Cotija","Tlayacapan",null,"Juárez","El Barrio de la Soledad","Camocuautla",null,null,"San Ciro de Acosta",null,"Granados",null,"Ocampo","San Francisco Tetlanohcan","Camerino Z. Mendoza","Dzilam González","Miguel Auza"]
[null,null,null,null,null,null,null,"Veracruz",null,null,null,null,"Coapilla","Guerrero",null,"Saltillo",null,"San Luis del Cordero","San Francisco del Rincón","Cuetzala del Progreso","Ixmiquilpan","Degollado","Coyotepec","Cuitzeo","Totolapan",null,"Lampazos de Naranjo","El Espinal","Cañada Morelos",null,null,"San Luis Potosí",null,"Guaymas",null,"Padilla","San Jerónimo Zacualpan","Carlos A. Carrillo","Dzitás","Momax"]
[null,null,null,null,null,null,null,"Yucatán",null,null,null,null,"Comitán de Domínguez","Hidalgo del Parral",null,"San Buenaventura",null,"San Pedro del Gallo","San José Iturbide","Cutzamala de Pinzón","Jacala de Ledezma","Ejutla","Cuautitlán","Ecuandureo","Xochitepec",null,"Linares","Eloxochitlán de Flores Magón","Caxhuacan",null,null,"San Martín Chalchicuautla",null,"Hermosillo",null,"Palmillas","San José Teacalco","Carrillo Puerto","Dzoncauich","Monte Escobedo"]
[null,null,null,null,null,null,null,"Zacatecas",null,null,null,null,"Copainalá","Huejotitán",null,"San Juan de Sabinas",null,"Santa Clara","San Luis de la Paz","Eduardo Neri","Jaltocán","El Arenal","Cuautitlán Izcalli","Epitacio Huerta","Xoxocotla",null,"Los Aldamas","Fresnillo de Trujano","Chalchicomula de Sesma",null,null,"San Nicolás Tolentino",null,"Huachinera",null,"Reynosa","San Juan Huactzinco","Castillo de Teayo","Espita","Morelos"]
[null,null,null,null,null,null,null,null,null,null,null,null,"El Bosque","Ignacio Zaragoza",null,"San Pedro",null,"Santiago Papasquiaro","San Miguel de Allende","Florencio Villarreal","Juárez Hidalgo","El Grullo","Donato Guerra","Erongarícuaro","Yautepec",null,"Los Herreras","Guadalupe de Ramírez","Chapulco",null,null,"San Vicente Tancuayalab",null,"Huásabas",null,"Río Bravo","San Lorenzo Axocomanitla","Catemaco","Halachó","Moyahua de Estrada"]
[null,null,null,null,null,null,null,null,null,null,null,null,"El Parral","Janos",null,"Sierra Mojada",null,"Súchil","Santa Catarina","General Canuto A. Neri","La Misión","El Limón","Ecatepec de Morelos","Gabriel Zamora","Yecapixtla",null,"Los Ramones","Guadalupe Etla","Chiautla",null,null,"Santa Catarina",null,"Huatabampo",null,"San Carlos","San Lucas Tecopilco","Cazones de Herrera","Hocabá","Nochistlán de Mejía"]
[null,null,null,null,null,null,null,null,null,null,null,null,"El Porvenir","Jiménez",null,"Torreón",null,"Tamazula","Santa Cruz de Juventino Rosas","General Heliodoro Castillo","Lolotla","El Salto","Ecatzingo","Hidalgo","Zacatepec",null,"Marín","Guelatao de Juárez","Chiautzingo",null,null,"Santa María del Río",null,"Huépac",null,"San Fernando","San Pablo del Monte","Cerro Azul","Hoctún","Noria de Ángeles"]
[null,null,null,null,null,null,null,null,null,null,null,null,"Emiliano Zapata","Juárez",null,"Viesca",null,"Tepehuanes","Santiago Maravatío","Huamuxtitlán","Metepec","Encarnación de Díaz","El Oro","Huandacareo","Zacualpan de Amilpas",null,"Melchor Ocampo","Guevea de Humboldt","Chichiquila",null,null,"Santo Domingo",null,"Imuris",null,"San Nicolás","Sanctórum de Lázaro Cárdenas","Chacaltianguis","Homún","Ojocaliente"]
[null,null,null,null,null,null,null,null,null,null,null,null,"Escuintla","Julimes",null,"Villa Unión",null,"Tlahualilo","Silao de la Victoria","Huitzuco de los Figueroa","Metztitlán","Etzatlán","Huehuetoca","Huaniqueo",null,null,"Mier y Noriega","Heroica Ciudad de Ejutla de Crespo","Chiconcuautla",null,null,"Soledad de Graciano Sánchez",null,"La Colorada",null,"Soto la Marina","Santa Ana Nopalucan","Chalma","Huhí","Pánuco"]
[null,null,null,null,null,null,null,null,null,null,null,null,"Francisco León","La Cruz",null,"Zaragoza",null,"Topia","Tarandacuao","Iguala de la Independencia","Mineral de la Reforma","Gómez Farías","Hueypoxtla","Huetamo",null,null,"Mina","Heroica Ciudad de Huajuapan de León","Chietla",null,null,"Tamasopo",null,"Magdalena",null,"Tampico","Santa Apolonia Teacalco","Chiconamel","Hunucmá","Pinos"]
[null,null,null,null,null,null,null,null,null,null,null,null,"Frontera Comalapa","López",null,null,null,"Vicente Guerrero","Tarimoro","Igualapa","Mineral del Chico","Guachinango","Huixquilucan","Huiramba",null,null,"Montemorelos","Heroica Ciudad de Tlaxiaco","Chigmecatitlán",null,null,"Tamazunchale",null,"Mazatán",null,"Tula","Santa Catarina Ayometla","Chiconquiaco","Ixil","Río Grande"]
[null,null,null,null,null,null,null,null,null,null,null,null,"Frontera Hidalgo","Madera",null,null,null,null,"Tierra Blanca","Iliatenco","Mineral del Monte","Guadalajara","Isidro Fabela","Indaparapeo",null,null,"Monterrey","Heroica Villa Tezoatlán de Segura y Luna, Cuna de la Independencia de Oaxaca","Chignahuapan",null,null,"Tampacán",null,"Moctezuma",null,"Valle Hermoso","Santa Cruz Quilehtla","Chicontepec","Izamal","Sain Alto"]
[null,null,null,null,null,null,null,null,null,null,null,null,"Honduras de la Sierra","Maguarichi",null,null,null,null,"Uriangato","Ixcateopan de Cuauhtémoc","Mixquiahuala de Juárez","Hostotipaquillo","Ixtapaluca","Irimbo",null,null,"Parás","Huautepec","Chignautla",null,null,"Tampamolón Corona",null,"Naco",null,"Victoria","Santa Cruz Tlaxcala","Chinameca","Kanasín","Santa María de la Paz"]
[null,null,null,null,null,null,null,null,null,null,null,null,"Huehuetán","Manuel Benavides",null,null,null,null,"Valle de Santiago","José Joaquín de Herrera","Molango de Escamilla","Huejúcar","Ixtapan de la Sal","Ixtlán",null,null,"Pesquería","Huautla de Jiménez","Chila",null,null,"Tamuín",null,"Nácori Chico",null,"Villagrán","Santa Isabel Xiloxoxtla","Chinampa de Gorostiza","Kantunil","Sombrerete"]
[null,null,null,null,null,null,null,null,null,null,null,null,"Huitiupán","Matachí",null,null,null,null,"Victoria","Juan R. Escudero","Nicolás Flores","Huejuquilla el Alto","Ixtapan del Oro","Jacona",null,null,"Rayones","Ixpantepec Nieves","Chila de la Sal",null,null,"Tancanhuitz",null,"Nacozari de García",null,"Xicoténcatl","Tenancingo","Chocamán","Kaua","Susticacán"]
[null,null,null,null,null,null,null,null,null,null,null,null,"Huixtán","Matamoros",null,null,null,null,"Villagrán","Juchitán","Nopala de Villagrán","Ixtlahuacán de los Membrillos","Ixtlahuaca","Jiménez",null,null,"Sabinas Hidalgo","Ixtlán de Juárez","Chilchotla",null,null,"Tanlajás",null,"Navojoa",null,null,"Teolocholco","Chontla","Kinchil","Tabasco"]
[null,null,null,null,null,null,null,null,null,null,null,null,"Huixtla","Meoqui",null,null,null,null,"Xichú","La Unión de Isidoro Montes de Oca","Omitlán de Juárez","Ixtlahuacán del Río","Jaltenco","Jiquilpan",null,null,"Salinas Victoria","Juchitán de Zaragoza","Chinantla",null,null,"Tanquián de Escobedo",null,"Nogales",null,null,"Tepetitla de Lardizábal","Chumatlán","Kopomá","Tepechitlán"]
[null,null,null,null,null,null,null,null,null,null,null,null,"Ixhuatán","Morelos",null,null,null,null,"Yuriria","Leonardo Bravo","Pachuca de Soto","Jalostotitlán","Jilotepec","José Sixto Verduzco",null,null,"San Nicolás de los Garza","La Compañía","Coatepec",null,null,"Tierra Nueva",null,"Ónavas",null,null,"Tepeyanco","Citlaltépetl","Mama","Tepetongo"]
[null,null,null,null,null,null,null,null,null,null,null,null,"Ixtacomitán","Moris",null,null,null,null,null,"Malinaltepec","Pacula","Jamay","Jilotzingo","Juárez",null,null,"San Pedro Garza García","La Pe","Coatzingo",null,null,"Vanegas",null,"Opodepe",null,null,"Terrenate","Coacoatzintla","Maní","Teúl de González Ortega"]
[null,null,null,null,null,null,null,null,null,null,null,null,"Ixtapa","Namiquipa",null,null,null,null,null,"Marquelia","Pisaflores","Jesús María","Jiquipilco","Jungapeo",null,null,"Santa Catarina","La Reforma","Cohetzala",null,null,"Venado",null,"Oquitoa",null,null,"Tetla de la Solidaridad","Coahuitlán","Maxcanú","Tlaltenango de Sánchez Román"]
[null,null,null,null,null,null,null,null,null,null,null,null,"Ixtapangajoya","Nonoava",null,null,null,null,null,"Mártir de Cuilapan","Progreso de Obregón","Jilotlán de los Dolores","Jocotitlán","La Huacana",null,null,"Santiago","La Trinidad Vista Hermosa","Cohuecan",null,null,"Villa de Arista",null,"Pitiquito",null,null,"Tetlatlahuca","Coatepec","Mayapán","Trancoso"]
[null,null,null,null,null,null,null,null,null,null,null,null,"Jiquipilas","Nuevo Casas Grandes",null,null,null,null,null,"Metlatónoc","San Agustín Metzquititlán","Jocotepec","Joquicingo","La Piedad",null,null,"Vallecillo","Loma Bonita","Coronango",null,null,"Villa de Arriaga",null,"Puerto Peñasco",null,null,"Tlaxcala","Coatzacoalcos","Mérida","Trinidad García de la Cadena"]
[null,null,null,null,null,null,null,null,null,null,null,null,"Jitotol","Ocampo",null,null,null,null,null,"Mochitlán","San Agustín Tlaxiaca","Juanacatlán","Juchitepec","Lagunillas",null,null,"Villaldama","Magdalena Apasco","Coxcatlán",null,null,"Villa de Guadalupe",null,"Quiriego",null,null,"Tlaxco","Coatzintla","Mocochá","Valparaíso"]
[null,null,null,null,null,null,null,null,null,null,null,null,"Juárez","Ojinaga",null,null,null,null,null,"Olinalá","San Bartolo Tutotepec","Juchitlán","La Paz","Lázaro Cárdenas",null,null,null,"Magdalena Jaltepec","Coyomeapan",null,null,"Villa de la Paz",null,"Rayón",null,null,"Tocatlán","Coetzala","Motul","Vetagrande"]
[null,null,null,null,null,null,null,null,null,null,null,null,"La Concordia","Praxedis G. Guerrero",null,null,null,null,null,"Ometepec","San Felipe Orizatlán","La Barca","Lerma","Los Reyes",null,null,null,"Magdalena Mixtepec","Coyotepec",null,null,"Villa de Ramos",null,"Rosario",null,null,"Totolac","Colipa","Muna","Villa de Cos"]
[null,null,null,null,null,null,null,null,null,null,null,null,"La Grandeza","Riva Palacio",null,null,null,null,null,"Pedro Ascencio Alquisiras","San Salvador","La Huerta","Luvianos","Madero",null,null,null,"Magdalena Ocotlán","Cuapiaxtla de Madero",null,null,"Villa de Reyes",null,"Sahuaripa",null,null,"Tzompantepec","Comapa","Muxupip","Villa García"]
[null,null,null,null,null,null,null,null,null,null,null,null,"La Independencia","Rosales",null,null,null,null,null,"Petatlán","Santiago de Anaya","La Manzanilla de la Paz","Malinalco","Maravatío",null,null,null,"Magdalena Peñasco","Cuautempan",null,null,"Villa Hidalgo",null,"San Felipe de Jesús",null,null,"Xaloztoc","Córdoba","Opichén","Villa González Ortega"]
[null,null,null,null,null,null,null,null,null,null,null,null,"La Libertad","Rosario",null,null,null,null,null,"Pilcaya","Santiago Tulantepec de Lugo Guerrero","Lagos de Moreno","Melchor Ocampo","Marcos Castellanos",null,null,null,"Magdalena Teitipac","Cuautinchán",null,null,"Villa Juárez",null,"San Ignacio Río Muerto",null,null,"Xaltocan","Cosamaloapan de Carpio","Oxkutzcab","Villa Hidalgo"]
[null,null,null,null,null,null,null,null,null,null,null,null,"La Trinitaria","San Francisco de Borja",null,null,null,null,null,"Pungarabato","Singuilucan","Magdalena","Metepec","Morelia",null,null,null,"Magdalena Tequisistlán","Cuautlancingo",null,null,"Xilitla",null,"San Javier",null,null,"Xicohtzinco","Cosautlán de Carvajal","Panabá","Villanueva"]
[null,null,null,null,null,null,null,null,null,null,null,null,"Larráinzar","San Francisco de Conchos",null,null,null,null,null,"Quechultenango","Tasquillo","Mascota","Mexicaltzingo","Morelos",null,null,null,"Magdalena Tlacotepec","Cuayuca de Andrade",null,null,"Zaragoza",null,"San Luis Río Colorado",null,null,"Yauhquemehcan","Coscomatepec","Peto","Zacatecas"]
[null,null,null,null,null,null,null,null,null,null,null,null,"Las Margaritas","San Francisco del Oro",null,null,null,null,null,"San Luis Acatlán","Tecozautla","Mazamitla","Morelos","Múgica",null,null,null,"Magdalena Yodocono de Porfirio Díaz","Cuetzalan del Progreso",null,null,null,null,"San Miguel de Horcasitas",null,null,"Zacatelco","Cosoleacaque","Progreso"]
[null,null,null,null,null,null,null,null,null,null,null,null,"Las Rosas","Santa Bárbara",null,null,null,null,null,"San Marcos","Tenango de Doria","Mexticacán","Naucalpan de Juárez","Nahuatzen",null,null,null,"Magdalena Zahuatlán","Cuyoaco",null,null,null,null,"San Pedro de la Cueva",null,null,"Ziltlaltépec de Trinidad Sánchez Santos","Cotaxtla","Quintana Roo"]
[null,null,null,null,null,null,null,null,null,null,null,null,"Mapastepec","Santa Isabel",null,null,null,null,null,"San Miguel Totolapan","Tepeapulco","Mezquitic","Nextlalpan","Nocupétaro",null,null,null,"Mariscala de Juárez","Domingo Arenas",null,null,null,null,"Santa Ana",null,null,null,"Coxquihui","Río Lagartos"]
[null,null,null,null,null,null,null,null,null,null,null,null,"Maravilla Tenejapa","Satevó",null,null,null,null,null,"Taxco de Alarcón","Tepehuacán de Guerrero","Mixtlán","Nezahualcóyotl","Nuevo Parangaricutiro",null,null,null,"Mártires de Tacubaya","Eloxochitlán",null,null,null,null,"Santa Cruz",null,null,null,"Coyutla","Sacalum"]
[null,null,null,null,null,null,null,null,null,null,null,null,"Marqués de Comillas","Saucillo",null,null,null,null,null,"Tecoanapa","Tepeji del Río de Ocampo","Ocotlán","Nicolás Romero","Nuevo Urecho",null,null,null,"Matías Romero Avendaño","Epatlán",null,null,null,null,"Sáric",null,null,null,"Cuichapa","Samahil"]
[null,null,null,null,null,null,null,null,null,null,null,null,"Mazapa de Madero","Temósachic",null,null,null,null,null,"Técpan de Galeana","Tepetitlán","Ojuelos de Jalisco","Nopaltepec","Numarán",null,null,null,"Mazatlán Villa de Flores","Esperanza",null,null,null,null,"Soyopa",null,null,null,"Cuitláhuac","San Felipe"]
[null,null,null,null,null,null,null,null,null,null,null,null,"Mazatán","Urique",null,null,null,null,null,"Teloloapan","Tetepango","Pihuamo","Ocoyoacac","Ocampo",null,null,null,"Mesones Hidalgo","Francisco Z. Mena",null,null,null,null,"Suaqui Grande",null,null,null,"El Higo","Sanahcat"]
[null,null,null,null,null,null,null,null,null,null,null,null,"Metapa","Uruachi",null,null,null,null,null,"Tepecoacuilco de Trujano","Tezontepec de Aldama","Poncitlán","Ocuilan","Pajacuarán",null,null,null,"Miahuatlán de Porfirio Díaz","General Felipe Ángeles",null,null,null,null,"Tepache",null,null,null,"Emiliano Zapata","Santa Elena"]
[null,null,null,null,null,null,null,null,null,null,null,null,"Mezcalapa","Valle de Zaragoza",null,null,null,null,null,"Tetipac","Tianguistengo","Puerto Vallarta","Otumba","Panindícuaro",null,null,null,"Mixistlán de la Reforma","Guadalupe",null,null,null,null,"Trincheras",null,null,null,"Espinal","Seyé"]
[null,null,null,null,null,null,null,null,null,null,null,null,"Mitontic",null,null,null,null,null,null,"Tixtla de Guerrero","Tizayuca","Quitupan","Otzoloapan","Paracho",null,null,null,"Monjas","Guadalupe Victoria",null,null,null,null,"Tubutama",null,null,null,"Filomeno Mata","Sinanché"]
[null,null,null,null,null,null,null,null,null,null,null,null,"Montecristo de Guerrero",null,null,null,null,null,null,"Tlacoachistlahuaca","Tlahuelilpan","San Cristóbal de la Barranca","Otzolotepec","Parácuaro",null,null,null,"Natividad","Hermenegildo Galeana",null,null,null,null,"Ures",null,null,null,"Fortín","Sotuta"]
[null,null,null,null,null,null,null,null,null,null,null,null,"Motozintla",null,null,null,null,null,null,"Tlacoapa","Tlahuiltepa","San Diego de Alejandría","Ozumba","Pátzcuaro",null,null,null,"Nazareno Etla","Honey",null,null,null,null,"Villa Hidalgo",null,null,null,"Gutiérrez Zamora","Sucilá"]
[null,null,null,null,null,null,null,null,null,null,null,null,"Nicolás Ruíz",null,null,null,null,null,null,"Tlalchapa","Tlanalapa","San Gabriel","Papalotla","Penjamillo",null,null,null,"Nejapa de Madero","Huaquechula",null,null,null,null,"Villa Pesqueira",null,null,null,"Hidalgotitlán","Sudzal"]
[null,null,null,null,null,null,null,null,null,null,null,null,"Ocosingo",null,null,null,null,null,null,"Tlalixtaquilla de Maldonado","Tlanchinol","San Ignacio Cerro Gordo","Polotitlán","Peribán",null,null,null,"Nuevo Zoquiápam","Huatlatlauca",null,null,null,null,"Yécora",null,null,null,"Huatusco","Suma"]
[null,null,null,null,null,null,null,null,null,null,null,null,"Ocotepec",null,null,null,null,null,null,"Tlapa de Comonfort","Tlaxcoapan","San Juan de los Lagos","Rayón","Purépero",null,null,null,"Oaxaca de Juárez","Huauchinango",null,null,null,null,null,null,null,null,"Huayacocotla","Tahdziú"]
[null,null,null,null,null,null,null,null,null,null,null,null,"Ocozocoautla de Espinosa",null,null,null,null,null,null,"Tlapehuala","Tolcayuca","San Juanito de Escobedo","San Antonio la Isla","Puruándiro",null,null,null,"Ocotlán de Morelos","Huehuetla",null,null,null,null,null,null,null,null,"Hueyapan de Ocampo","Tahmek"]
[null,null,null,null,null,null,null,null,null,null,null,null,"Ostuacán",null,null,null,null,null,null,"Xalpatláhuac","Tula de Allende","San Julián","San Felipe del Progreso","Queréndaro",null,null,null,"Pinotepa de Don Luis","Huehuetlán el Chico",null,null,null,null,null,null,null,null,"Huiloapan de Cuauhtémoc","Teabo"]
[null,null,null,null,null,null,null,null,null,null,null,null,"Osumacinta",null,null,null,null,null,null,"Xochihuehuetlán","Tulancingo de Bravo","San Marcos","San José del Rincón","Quiroga",null,null,null,"Pluma Hidalgo","Huehuetlán el Grande",null,null,null,null,null,null,null,null,"Ignacio de la Llave","Tecoh"]
[null,null,null,null,null,null,null,null,null,null,null,null,"Oxchuc",null,null,null,null,null,null,"Xochistlahuaca","Villa de Tezontepec","San Martín de Bolaños","San Martín de las Pirámides","Sahuayo",null,null,null,"Putla Villa de Guerrero","Huejotzingo",null,null,null,null,null,null,null,null,"Ilamatlán","Tekal de Venegas"]
[null,null,null,null,null,null,null,null,null,null,null,null,"Palenque",null,null,null,null,null,null,"Zapotitlán Tablas","Xochiatipan","San Martín Hidalgo","San Mateo Atenco","Salvador Escalante",null,null,null,"Reforma de Pineda","Hueyapan",null,null,null,null,null,null,null,null,"Isla","Tekantó"]
[null,null,null,null,null,null,null,null,null,null,null,null,"Pantelhó",null,null,null,null,null,null,"Zihuatanejo de Azueta","Xochicoatlán","San Miguel el Alto","San Simón de Guerrero","San Lucas",null,null,null,"Reyes Etla","Hueytamalco",null,null,null,null,null,null,null,null,"Ixcatepec","Tekax"]
[null,null,null,null,null,null,null,null,null,null,null,null,"Pantepec",null,null,null,null,null,null,"Zirándaro","Yahualica","San Pedro Tlaquepaque","Santo Tomás","Santa Ana Maya",null,null,null,"Rojas de Cuauhtémoc","Hueytlalpan",null,null,null,null,null,null,null,null,"Ixhuacán de los Reyes","Tekit"]
[null,null,null,null,null,null,null,null,null,null,null,null,"Pichucalco",null,null,null,null,null,null,"Zitlala","Zacualtipán de Ángeles","San Sebastián del Oeste","Soyaniquilpan de Juárez","Senguio",null,null,null,"Salina Cruz","Huitzilan de Serdán",null,null,null,null,null,null,null,null,"Ixhuatlán de Madero","Tekom"]
[null,null,null,null,null,null,null,null,null,null,null,null,"Pijijiapan",null,null,null,null,null,null,null,"Zapotlán de Juárez","Santa María de los Ángeles","Sultepec","Susupuato",null,null,null,"San Agustín Amatengo","Huitziltepec",null,null,null,null,null,null,null,null,"Ixhuatlán del Café","Telchac Pueblo"]
[null,null,null,null,null,null,null,null,null,null,null,null,"Pueblo Nuevo Solistahuacán",null,null,null,null,null,null,null,"Zempoala","Santa María del Oro","Tecámac","Tacámbaro",null,null,null,"San Agustín Atenango","Ixcamilpa de Guerrero",null,null,null,null,null,null,null,null,"Ixhuatlán del Sureste","Telchac Puerto"]
[null,null,null,null,null,null,null,null,null,null,null,null,"Rayón",null,null,null,null,null,null,null,"Zimapán","Sayula","Tejupilco","Tancítaro",null,null,null,"San Agustín Chayuco","Ixcaquixtla",null,null,null,null,null,null,null,null,"Ixhuatlancillo","Temax"]
[null,null,null,null,null,null,null,null,null,null,null,null,"Reforma",null,null,null,null,null,null,null,null,"Tala","Temamatla","Tangamandapio",null,null,null,"San Agustín de las Juntas","Ixtacamaxtitlán",null,null,null,null,null,null,null,null,"Ixmatlahuacan","Temozón"]
[null,null,null,null,null,null,null,null,null,null,null,null,"Rincón Chamula San Pedro",null,null,null,null,null,null,null,null,"Talpa de Allende","Temascalapa","Tangancícuaro",null,null,null,"San Agustín Etla","Ixtepec",null,null,null,null,null,null,null,null,"Ixtaczoquitlán","Tepakán"]
[null,null,null,null,null,null,null,null,null,null,null,null,"Sabanilla",null,null,null,null,null,null,null,null,"Tamazula de Gordiano","Temascalcingo","Tanhuato",null,null,null,"San Agustín Loxicha","Izúcar de Matamoros",null,null,null,null,null,null,null,null,"Jalacingo","Tetiz"]
[null,null,null,null,null,null,null,null,null,null,null,null,"Salto de Agua",null,null,null,null,null,null,null,null,"Tapalpa","Temascaltepec","Taretan",null,null,null,"San Agustín Tlacotepec","Jalpan",null,null,null,null,null,null,null,null,"Jalcomulco","Teya"]
[null,null,null,null,null,null,null,null,null,null,null,null,"San Andrés Duraznal",null,null,null,null,null,null,null,null,"Tecalitlán","Temoaya","Tarímbaro",null,null,null,"San Agustín Yatareni","Jolalpan",null,null,null,null,null,null,null,null,"Jáltipan","Ticul"]
[null,null,null,null,null,null,null,null,null,null,null,null,"San Cristóbal de las Casas",null,null,null,null,null,null,null,null,"Techaluta de Montenegro","Tenancingo","Tepalcatepec",null,null,null,"San Andrés Cabecera Nueva","Jonotla",null,null,null,null,null,null,null,null,"Jamapa","Timucuy"]
[null,null,null,null,null,null,null,null,null,null,null,null,"San Fernando",null,null,null,null,null,null,null,null,"Tecolotlán","Tenango del Aire","Tingambato",null,null,null,"San Andrés Dinicuiti","Jopala",null,null,null,null,null,null,null,null,"Jesús Carranza","Tinum"]
[null,null,null,null,null,null,null,null,null,null,null,null,"San Juan Cancuc",null,null,null,null,null,null,null,null,"Tenamaxtlán","Tenango del Valle","Tingüindín",null,null,null,"San Andrés Huaxpaltepec","Juan C. Bonilla",null,null,null,null,null,null,null,null,"Jilotepec","Tixcacalcupul"]
[null,null,null,null,null,null,null,null,null,null,null,null,"San Lucas",null,null,null,null,null,null,null,null,"Teocaltiche","Teoloyucan","Tiquicheo de Nicolás Romero",null,null,null,"San Andrés Huayápam","Juan Galindo",null,null,null,null,null,null,null,null,"José Azueta","Tixkokob"]
[null,null,null,null,null,null,null,null,null,null,null,null,"Santiago el Pinar",null,null,null,null,null,null,null,null,"Teocuitatlán de Corona","Teotihuacán","Tlalpujahua",null,null,null,"San Andrés Ixtlahuaca","Juan N. Méndez",null,null,null,null,null,null,null,null,"Juan Rodríguez Clara","Tixmehuac"]
[null,null,null,null,null,null,null,null,null,null,null,null,"Siltepec",null,null,null,null,null,null,null,null,"Tepatitlán de Morelos","Tepetlaoxtoc","Tlazazalca",null,null,null,"San Andrés Lagunas","La Magdalena Tlatlauquitepec",null,null,null,null,null,null,null,null,"Juchique de Ferrer","Tixpéhual"]
[null,null,null,null,null,null,null,null,null,null,null,null,"Simojovel",null,null,null,null,null,null,null,null,"Tequila","Tepetlixpa","Tocumbo",null,null,null,"San Andrés Nuxiño","Lafragua",null,null,null,null,null,null,null,null,"La Antigua","Tizimín"]
[null,null,null,null,null,null,null,null,null,null,null,null,"Sitalá",null,null,null,null,null,null,null,null,"Teuchitlán","Tepotzotlán","Tumbiscatío",null,null,null,"San Andrés Paxtlán","Libres",null,null,null,null,null,null,null,null,"La Perla","Tunkás"]
[null,null,null,null,null,null,null,null,null,null,null,null,"Socoltenango",null,null,null,null,null,null,null,null,"Tizapán el Alto","Tequixquiac","Turicato",null,null,null,"San Andrés Sinaxtla","Los Reyes de Juárez",null,null,null,null,null,null,null,null,"Landero y Coss","Tzucacab"]
[null,null,null,null,null,null,null,null,null,null,null,null,"Solosuchiapa",null,null,null,null,null,null,null,null,"Tlajomulco de Zúñiga","Texcaltitlán","Tuxpan",null,null,null,"San Andrés Solaga","Mazapiltepec de Juárez",null,null,null,null,null,null,null,null,"Las Choapas","Uayma"]
[null,null,null,null,null,null,null,null,null,null,null,null,"Soyaló",null,null,null,null,null,null,null,null,"Tolimán","Texcalyacac","Tuzantla",null,null,null,"San Andrés Teotilálpam","Mixtla",null,null,null,null,null,null,null,null,"Las Minas","Ucú"]
[null,null,null,null,null,null,null,null,null,null,null,null,"Suchiapa",null,null,null,null,null,null,null,null,"Tomatlán","Texcoco","Tzintzuntzan",null,null,null,"San Andrés Tepetlapa","Molcaxac",null,null,null,null,null,null,null,null,"Las Vigas de Ramírez","Umán"]
[null,null,null,null,null,null,null,null,null,null,null,null,"Suchiate",null,null,null,null,null,null,null,null,"Tonalá","Tezoyuca","Tzitzio",null,null,null,"San Andrés Yaá","Naupan",null,null,null,null,null,null,null,null,"Lerdo de Tejada","Valladolid"]
[null,null,null,null,null,null,null,null,null,null,null,null,"Sunuapa",null,null,null,null,null,null,null,null,"Tonaya","Tianguistenco","Uruapan",null,null,null,"San Andrés Zabache","Nauzontla",null,null,null,null,null,null,null,null,"Los Reyes","Xocchel"]
[null,null,null,null,null,null,null,null,null,null,null,null,"Tapachula",null,null,null,null,null,null,null,null,"Tonila","Timilpan","Venustiano Carranza",null,null,null,"San Andrés Zautla","Nealtican",null,null,null,null,null,null,null,null,"Magdalena","Yaxcabá"]
[null,null,null,null,null,null,null,null,null,null,null,null,"Tapalapa",null,null,null,null,null,null,null,null,"Totatiche","Tlalmanalco","Villamar",null,null,null,"San Antonino Castillo Velasco","Nicolás Bravo",null,null,null,null,null,null,null,null,"Maltrata","Yaxkukul"]
[null,null,null,null,null,null,null,null,null,null,null,null,"Tapilula",null,null,null,null,null,null,null,null,"Tototlán","Tlalnepantla de Baz","Vista Hermosa",null,null,null,"San Antonino el Alto","Nopalucan",null,null,null,null,null,null,null,null,"Manlio Fabio Altamirano","Yobaín"]
[null,null,null,null,null,null,null,null,null,null,null,null,"Tecpatán",null,null,null,null,null,null,null,null,"Tuxcacuesco","Tlatlaya","Yurécuaro",null,null,null,"San Antonino Monte Verde","Ocotepec",null,null,null,null,null,null,null,null,"Mariano Escobedo"]
[null,null,null,null,null,null,null,null,null,null,null,null,"Tenejapa",null,null,null,null,null,null,null,null,"Tuxcueca","Toluca","Zacapu",null,null,null,"San Antonio Acutla","Ocoyucan",null,null,null,null,null,null,null,null,"Martínez de la Torre"]
[null,null,null,null,null,null,null,null,null,null,null,null,"Teopisca",null,null,null,null,null,null,null,null,"Tuxpan","Tonanitla","Zamora",null,null,null,"San Antonio de la Cal","Olintla",null,null,null,null,null,null,null,null,"Mecatlán"]
[null,null,null,null,null,null,null,null,null,null,null,null,"Tila",null,null,null,null,null,null,null,null,"Unión de San Antonio","Tonatico","Zináparo",null,null,null,"San Antonio Huitepec","Oriental",null,null,null,null,null,null,null,null,"Mecayapan"]
[null,null,null,null,null,null,null,null,null,null,null,null,"Tonalá",null,null,null,null,null,null,null,null,"Unión de Tula","Tultepec","Zinapécuaro",null,null,null,"San Antonio Nanahuatípam","Pahuatlán",null,null,null,null,null,null,null,null,"Medellín de Bravo"]
[null,null,null,null,null,null,null,null,null,null,null,null,"Totolapa",null,null,null,null,null,null,null,null,"Valle de Guadalupe","Tultitlán","Ziracuaretiro",null,null,null,"San Antonio Sinicahua","Palmar de Bravo",null,null,null,null,null,null,null,null,"Miahuatlán"]
[null,null,null,null,null,null,null,null,null,null,null,null,"Tumbalá",null,null,null,null,null,null,null,null,"Valle de Juárez","Valle de Bravo","Zitácuaro",null,null,null,"San Antonio Tepetlapa","Pantepec",null,null,null,null,null,null,null,null,"Minatitlán"]
[null,null,null,null,null,null,null,null,null,null,null,null,"Tuxtla Chico",null,null,null,null,null,null,null,null,"Villa Corona","Valle de Chalco Solidaridad",null,null,null,null,"San Baltazar Chichicápam","Petlalcingo",null,null,null,null,null,null,null,null,"Misantla"]
[null,null,null,null,null,null,null,null,null,null,null,null,"Tuxtla Gutiérrez",null,null,null,null,null,null,null,null,"Villa Guerrero","Villa de Allende",null,null,null,null,"San Baltazar Loxicha","Piaxtla",null,null,null,null,null,null,null,null,"Mixtla de Altamirano"]
[null,null,null,null,null,null,null,null,null,null,null,null,"Tuzantán",null,null,null,null,null,null,null,null,"Villa Hidalgo","Villa del Carbón",null,null,null,null,"San Baltazar Yatzachi el Bajo","Puebla",null,null,null,null,null,null,null,null,"Moloacán"]
[null,null,null,null,null,null,null,null,null,null,null,null,"Tzimol",null,null,null,null,null,null,null,null,"Villa Purificación","Villa Guerrero",null,null,null,null,"San Bartolo Coyotepec","Quecholac",null,null,null,null,null,null,null,null,"Nanchital de Lázaro Cárdenas del Río"]
[null,null,null,null,null,null,null,null,null,null,null,null,"Unión Juárez",null,null,null,null,null,null,null,null,"Yahualica de González Gallo","Villa Victoria",null,null,null,null,"San Bartolo Soyaltepec","Quimixtlán",null,null,null,null,null,null,null,null,"Naolinco"]
[null,null,null,null,null,null,null,null,null,null,null,null,"Venustiano Carranza",null,null,null,null,null,null,null,null,"Zacoalco de Torres","Xalatlaco",null,null,null,null,"San Bartolo Yautepec","Rafael Lara Grajales",null,null,null,null,null,null,null,null,"Naranjal"]
[null,null,null,null,null,null,null,null,null,null,null,null,"Villa Comaltitlán",null,null,null,null,null,null,null,null,"Zapopan","Xonacatlán",null,null,null,null,"San Bartolomé Ayautla","San Andrés Cholula",null,null,null,null,null,null,null,null,"Naranjos Amatlán"]
[null,null,null,null,null,null,null,null,null,null,null,null,"Villa Corzo",null,null,null,null,null,null,null,null,"Zapotiltic","Zacazonapan",null,null,null,null,"San Bartolomé Loxicha","San Antonio Cañada",null,null,null,null,null,null,null,null,"Nautla"]
[null,null,null,null,null,null,null,null,null,null,null,null,"Villaflores",null,null,null,null,null,null,null,null,"Zapotitlán de Vadillo","Zacualpan",null,null,null,null,"San Bartolomé Quialana","San Diego la Mesa Tochimiltzingo",null,null,null,null,null,null,null,null,"Nogales"]
[null,null,null,null,null,null,null,null,null,null,null,null,"Yajalón",null,null,null,null,null,null,null,null,"Zapotlán del Rey","Zinacantepec",null,null,null,null,"San Bartolomé Yucuañe","San Felipe Teotlalcingo",null,null,null,null,null,null,null,null,"Oluta"]
[null,null,null,null,null,null,null,null,null,null,null,null,"Zinacantán",null,null,null,null,null,null,null,null,"Zapotlán el Grande","Zumpahuacán",null,null,null,null,"San Bartolomé Zoogocho","San Felipe Tepatlán",null,null,null,null,null,null,null,null,"Omealca"]
[null,null,null,null,null,null,null,null,null,null,null,null,null,null,null,null,null,null,null,null,null,"Zapotlanejo","Zumpango",null,null,null,null,"San Bernardo Mixtepec","San Gabriel Chilac",null,null,null,null,null,null,null,null,"Orizaba"]
[null,null,null,null,null,null,null,null,null,null,null,null,null,null,null,null,null,null,null,null,null,null,null,null,null,null,null,"San Blas Atempa","San Gregorio Atzompa",null,null,null,null,null,null,null,null,"Otatitlán"]
[null,null,null,null,null,null,null,null,null,null,null,null,null,null,null,null,null,null,null,null,null,null,null,null,null,null,null,"San Carlos Yautepec","San Jerónimo Tecuanipan",null,null,null,null,null,null,null,null,"Oteapan"]
[null,null,null,null,null,null,null,null,null,null,null,null,null,null,null,null,null,null,null,null,null,null,null,null,null,null,null,"San Cristóbal Amatlán","San Jerónimo Xayacatlán",null,null,null,null,null,null,null,null,"Ozuluama de Mascareñas"]
[null,null,null,null,null,null,null,null,null,null,null,null,null,null,null,null,null,null,null,null,null,null,null,null,null,null,null,"San Cristóbal Amoltepec","San José Chiapa",null,null,null,null,null,null,null,null,"Pajapan"]
[null,null,null,null,null,null,null,null,null,null,null,null,null,null,null,null,null,null,null,null,null,null,null,null,null,null,null,"San Cristóbal Lachirioag","San José Miahuatlán",null,null,null,null,null,null,null,null,"Pánuco"]
[null,null,null,null,null,null,null,null,null,null,null,null,null,null,null,null,null,null,null,null,null,null,null,null,null,null,null,"San Cristóbal Suchixtlahuaca","San Juan Atenco",null,null,null,null,null,null,null,null,"Papantla"]
[null,null,null,null,null,null,null,null,null,null,null,null,null,null,null,null,null,null,null,null,null,null,null,null,null,null,null,"San Dionisio del Mar","San Juan Atzompa",null,null,null,null,null,null,null,null,"Paso de Ovejas"]
[null,null,null,null,null,null,null,null,null,null,null,null,null,null,null,null,null,null,null,null,null,null,null,null,null,null,null,"San Dionisio Ocotepec","San Martín Texmelucan",null,null,null,null,null,null,null,null,"Paso del Macho"]
[null,null,null,null,null,null,null,null,null,null,null,null,null,null,null,null,null,null,null,null,null,null,null,null,null,null,null,"San Dionisio Ocotlán","San Martín Totoltepec",null,null,null,null,null,null,null,null,"Perote"]
[null,null,null,null,null,null,null,null,null,null,null,null,null,null,null,null,null,null,null,null,null,null,null,null,null,null,null,"San Esteban Atatlahuca","San Matías Tlalancaleca",null,null,null,null,null,null,null,null,"Platón Sánchez"]
[null,null,null,null,null,null,null,null,null,null,null,null,null,null,null,null,null,null,null,null,null,null,null,null,null,null,null,"San Felipe Jalapa de Díaz","San Miguel Ixitlán",null,null,null,null,null,null,null,null,"Playa Vicente"]
[null,null,null,null,null,null,null,null,null,null,null,null,null,null,null,null,null,null,null,null,null,null,null,null,null,null,null,"San Felipe Tejalápam","San Miguel Xoxtla",null,null,null,null,null,null,null,null,"Poza Rica de Hidalgo"]
[null,null,null,null,null,null,null,null,null,null,null,null,null,null,null,null,null,null,null,null,null,null,null,null,null,null,null,"San Felipe Usila","San Nicolás Buenos Aires",null,null,null,null,null,null,null,null,"Pueblo Viejo"]
[null,null,null,null,null,null,null,null,null,null,null,null,null,null,null,null,null,null,null,null,null,null,null,null,null,null,null,"San Francisco Cahuacuá","San Nicolás de los Ranchos",null,null,null,null,null,null,null,null,"Puente Nacional"]
[null,null,null,null,null,null,null,null,null,null,null,null,null,null,null,null,null,null,null,null,null,null,null,null,null,null,null,"San Francisco Cajonos","San Pablo Anicano",null,null,null,null,null,null,null,null,"Rafael Delgado"]
[null,null,null,null,null,null,null,null,null,null,null,null,null,null,null,null,null,null,null,null,null,null,null,null,null,null,null,"San Francisco Chapulapa","San Pedro Cholula",null,null,null,null,null,null,null,null,"Rafael Lucio"]
[null,null,null,null,null,null,null,null,null,null,null,null,null,null,null,null,null,null,null,null,null,null,null,null,null,null,null,"San Francisco Chindúa","San Pedro Yeloixtlahuaca",null,null,null,null,null,null,null,null,"Río Blanco"]
[null,null,null,null,null,null,null,null,null,null,null,null,null,null,null,null,null,null,null,null,null,null,null,null,null,null,null,"San Francisco del Mar","San Salvador el Seco",null,null,null,null,null,null,null,null,"Saltabarranca"]
[null,null,null,null,null,null,null,null,null,null,null,null,null,null,null,null,null,null,null,null,null,null,null,null,null,null,null,"San Francisco Huehuetlán","San Salvador el Verde",null,null,null,null,null,null,null,null,"San Andrés Tenejapan"]
[null,null,null,null,null,null,null,null,null,null,null,null,null,null,null,null,null,null,null,null,null,null,null,null,null,null,null,"San Francisco Ixhuatán","San Salvador Huixcolotla",null,null,null,null,null,null,null,null,"San Andrés Tuxtla"]
[null,null,null,null,null,null,null,null,null,null,null,null,null,null,null,null,null,null,null,null,null,null,null,null,null,null,null,"San Francisco Jaltepetongo","San Sebastián Tlacotepec",null,null,null,null,null,null,null,null,"San Juan Evangelista"]
[null,null,null,null,null,null,null,null,null,null,null,null,null,null,null,null,null,null,null,null,null,null,null,null,null,null,null,"San Francisco Lachigoló","Santa Catarina Tlaltempan",null,null,null,null,null,null,null,null,"San Rafael"]
[null,null,null,null,null,null,null,null,null,null,null,null,null,null,null,null,null,null,null,null,null,null,null,null,null,null,null,"San Francisco Logueche","Santa Inés Ahuatempan",null,null,null,null,null,null,null,null,"Santiago Sochiapan"]
[null,null,null,null,null,null,null,null,null,null,null,null,null,null,null,null,null,null,null,null,null,null,null,null,null,null,null,"San Francisco Nuxaño","Santa Isabel Cholula",null,null,null,null,null,null,null,null,"Santiago Tuxtla"]
[null,null,null,null,null,null,null,null,null,null,null,null,null,null,null,null,null,null,null,null,null,null,null,null,null,null,null,"San Francisco Ozolotepec","Santiago Miahuatlán",null,null,null,null,null,null,null,null,"Sayula de Alemán"]
[null,null,null,null,null,null,null,null,null,null,null,null,null,null,null,null,null,null,null,null,null,null,null,null,null,null,null,"San Francisco Sola","Santo Tomás Hueyotlipan",null,null,null,null,null,null,null,null,"Sochiapa"]
[null,null,null,null,null,null,null,null,null,null,null,null,null,null,null,null,null,null,null,null,null,null,null,null,null,null,null,"San Francisco Telixtlahuaca","Soltepec",null,null,null,null,null,null,null,null,"Soconusco"]
[null,null,null,null,null,null,null,null,null,null,null,null,null,null,null,null,null,null,null,null,null,null,null,null,null,null,null,"San Francisco Teopan","Tecali de Herrera",null,null,null,null,null,null,null,null,"Soledad Atzompa"]
[null,null,null,null,null,null,null,null,null,null,null,null,null,null,null,null,null,null,null,null,null,null,null,null,null,null,null,"San Francisco Tlapancingo","Tecamachalco",null,null,null,null,null,null,null,null,"Soledad de Doblado"]
[null,null,null,null,null,null,null,null,null,null,null,null,null,null,null,null,null,null,null,null,null,null,null,null,null,null,null,"San Gabriel Mixtepec","Tecomatlán",null,null,null,null,null,null,null,null,"Soteapan"]
[null,null,null,null,null,null,null,null,null,null,null,null,null,null,null,null,null,null,null,null,null,null,null,null,null,null,null,"San Ildefonso Amatlán","Tehuacán",null,null,null,null,null,null,null,null,"Tamalín"]
[null,null,null,null,null,null,null,null,null,null,null,null,null,null,null,null,null,null,null,null,null,null,null,null,null,null,null,"San Ildefonso Sola","Tehuitzingo",null,null,null,null,null,null,null,null,"Tamiahua"]
[null,null,null,null,null,null,null,null,null,null,null,null,null,null,null,null,null,null,null,null,null,null,null,null,null,null,null,"San Ildefonso Villa Alta","Tenampulco",null,null,null,null,null,null,null,null,"Tampico Alto"]
[null,null,null,null,null,null,null,null,null,null,null,null,null,null,null,null,null,null,null,null,null,null,null,null,null,null,null,"San Jacinto Amilpas","Teopantlán",null,null,null,null,null,null,null,null,"Tancoco"]
[null,null,null,null,null,null,null,null,null,null,null,null,null,null,null,null,null,null,null,null,null,null,null,null,null,null,null,"San Jacinto Tlacotepec","Teotlalco",null,null,null,null,null,null,null,null,"Tantima"]
[null,null,null,null,null,null,null,null,null,null,null,null,null,null,null,null,null,null,null,null,null,null,null,null,null,null,null,"San Jerónimo Coatlán","Tepanco de López",null,null,null,null,null,null,null,null,"Tantoyuca"]
[null,null,null,null,null,null,null,null,null,null,null,null,null,null,null,null,null,null,null,null,null,null,null,null,null,null,null,"San Jerónimo Silacayoapilla","Tepango de Rodríguez",null,null,null,null,null,null,null,null,"Tatahuicapan de Juárez"]
[null,null,null,null,null,null,null,null,null,null,null,null,null,null,null,null,null,null,null,null,null,null,null,null,null,null,null,"San Jerónimo Sosola","Tepatlaxco de Hidalgo",null,null,null,null,null,null,null,null,"Tatatila"]
[null,null,null,null,null,null,null,null,null,null,null,null,null,null,null,null,null,null,null,null,null,null,null,null,null,null,null,"San Jerónimo Taviche","Tepeaca",null,null,null,null,null,null,null,null,"Tecolutla"]
[null,null,null,null,null,null,null,null,null,null,null,null,null,null,null,null,null,null,null,null,null,null,null,null,null,null,null,"San Jerónimo Tecóatl","Tepemaxalco",null,null,null,null,null,null,null,null,"Tehuipango"]
[null,null,null,null,null,null,null,null,null,null,null,null,null,null,null,null,null,null,null,null,null,null,null,null,null,null,null,"San Jerónimo Tlacochahuaya","Tepeojuma",null,null,null,null,null,null,null,null,"Tempoal"]
[null,null,null,null,null,null,null,null,null,null,null,null,null,null,null,null,null,null,null,null,null,null,null,null,null,null,null,"San Jorge Nuchita","Tepetzintla",null,null,null,null,null,null,null,null,"Tenampa"]
[null,null,null,null,null,null,null,null,null,null,null,null,null,null,null,null,null,null,null,null,null,null,null,null,null,null,null,"San José Ayuquila","Tepexco",null,null,null,null,null,null,null,null,"Tenochtitlán"]
[null,null,null,null,null,null,null,null,null,null,null,null,null,null,null,null,null,null,null,null,null,null,null,null,null,null,null,"San José Chiltepec","Tepexi de Rodríguez",null,null,null,null,null,null,null,null,"Teocelo"]
[null,null,null,null,null,null,null,null,null,null,null,null,null,null,null,null,null,null,null,null,null,null,null,null,null,null,null,"San José del Peñasco","Tepeyahualco",null,null,null,null,null,null,null,null,"Tepatlaxco"]
[null,null,null,null,null,null,null,null,null,null,null,null,null,null,null,null,null,null,null,null,null,null,null,null,null,null,null,"San José del Progreso","Tepeyahualco de Cuauhtémoc",null,null,null,null,null,null,null,null,"Tepetlán"]
[null,null,null,null,null,null,null,null,null,null,null,null,null,null,null,null,null,null,null,null,null,null,null,null,null,null,null,"San José Estancia Grande","Tetela de Ocampo",null,null,null,null,null,null,null,null,"Tepetzintla"]
[null,null,null,null,null,null,null,null,null,null,null,null,null,null,null,null,null,null,null,null,null,null,null,null,null,null,null,"San José Independencia","Teteles de Ávila Castillo",null,null,null,null,null,null,null,null,"Tequila"]
[null,null,null,null,null,null,null,null,null,null,null,null,null,null,null,null,null,null,null,null,null,null,null,null,null,null,null,"San José Lachiguiri","Teziutlán",null,null,null,null,null,null,null,null,"Texcatepec"]
[null,null,null,null,null,null,null,null,null,null,null,null,null,null,null,null,null,null,null,null,null,null,null,null,null,null,null,"San José Tenango","Tianguismanalco",null,null,null,null,null,null,null,null,"Texhuacán"]
[null,null,null,null,null,null,null,null,null,null,null,null,null,null,null,null,null,null,null,null,null,null,null,null,null,null,null,"San Juan Achiutla","Tilapa",null,null,null,null,null,null,null,null,"Texistepec"]
[null,null,null,null,null,null,null,null,null,null,null,null,null,null,null,null,null,null,null,null,null,null,null,null,null,null,null,"San Juan Atepec","Tlachichuca",null,null,null,null,null,null,null,null,"Tezonapa"]
[null,null,null,null,null,null,null,null,null,null,null,null,null,null,null,null,null,null,null,null,null,null,null,null,null,null,null,"San Juan Bautista Atatlahuca","Tlacotepec de Benito Juárez",null,null,null,null,null,null,null,null,"Tierra Blanca"]
[null,null,null,null,null,null,null,null,null,null,null,null,null,null,null,null,null,null,null,null,null,null,null,null,null,null,null,"San Juan Bautista Coixtlahuaca","Tlacuilotepec",null,null,null,null,null,null,null,null,"Tihuatlán"]
[null,null,null,null,null,null,null,null,null,null,null,null,null,null,null,null,null,null,null,null,null,null,null,null,null,null,null,"San Juan Bautista Cuicatlán","Tlahuapan",null,null,null,null,null,null,null,null,"Tlachichilco"]
[null,null,null,null,null,null,null,null,null,null,null,null,null,null,null,null,null,null,null,null,null,null,null,null,null,null,null,"San Juan Bautista Guelache","Tlaltenango",null,null,null,null,null,null,null,null,"Tlacojalpan"]
[null,null,null,null,null,null,null,null,null,null,null,null,null,null,null,null,null,null,null,null,null,null,null,null,null,null,null,"San Juan Bautista Jayacatlán","Tlanepantla",null,null,null,null,null,null,null,null,"Tlacolulan"]
[null,null,null,null,null,null,null,null,null,null,null,null,null,null,null,null,null,null,null,null,null,null,null,null,null,null,null,"San Juan Bautista Lo de Soto","Tlaola",null,null,null,null,null,null,null,null,"Tlacotalpan"]
[null,null,null,null,null,null,null,null,null,null,null,null,null,null,null,null,null,null,null,null,null,null,null,null,null,null,null,"San Juan Bautista Suchitepec","Tlapacoya",null,null,null,null,null,null,null,null,"Tlacotepec de Mejía"]
[null,null,null,null,null,null,null,null,null,null,null,null,null,null,null,null,null,null,null,null,null,null,null,null,null,null,null,"San Juan Bautista Tlachichilco","Tlapanalá",null,null,null,null,null,null,null,null,"Tlalixcoyan"]
[null,null,null,null,null,null,null,null,null,null,null,null,null,null,null,null,null,null,null,null,null,null,null,null,null,null,null,"San Juan Bautista Tlacoatzintepec","Tlatlauquitepec",null,null,null,null,null,null,null,null,"Tlalnelhuayocan"]
[null,null,null,null,null,null,null,null,null,null,null,null,null,null,null,null,null,null,null,null,null,null,null,null,null,null,null,"San Juan Bautista Tuxtepec","Tlaxco",null,null,null,null,null,null,null,null,"Tlaltetela"]
[null,null,null,null,null,null,null,null,null,null,null,null,null,null,null,null,null,null,null,null,null,null,null,null,null,null,null,"San Juan Bautista Valle Nacional","Tochimilco",null,null,null,null,null,null,null,null,"Tlapacoyan"]
[null,null,null,null,null,null,null,null,null,null,null,null,null,null,null,null,null,null,null,null,null,null,null,null,null,null,null,"San Juan Cacahuatepec","Tochtepec",null,null,null,null,null,null,null,null,"Tlaquilpa"]
[null,null,null,null,null,null,null,null,null,null,null,null,null,null,null,null,null,null,null,null,null,null,null,null,null,null,null,"San Juan Chicomezúchil","Totoltepec de Guerrero",null,null,null,null,null,null,null,null,"Tlilapan"]
[null,null,null,null,null,null,null,null,null,null,null,null,null,null,null,null,null,null,null,null,null,null,null,null,null,null,null,"San Juan Chilateca","Tulcingo",null,null,null,null,null,null,null,null,"Tomatlán"]
[null,null,null,null,null,null,null,null,null,null,null,null,null,null,null,null,null,null,null,null,null,null,null,null,null,null,null,"San Juan Cieneguilla","Tuzamapan de Galeana",null,null,null,null,null,null,null,null,"Tonayán"]
[null,null,null,null,null,null,null,null,null,null,null,null,null,null,null,null,null,null,null,null,null,null,null,null,null,null,null,"San Juan Coatzóspam","Tzicatlacoyan",null,null,null,null,null,null,null,null,"Totutla"]
[null,null,null,null,null,null,null,null,null,null,null,null,null,null,null,null,null,null,null,null,null,null,null,null,null,null,null,"San Juan Colorado","Venustiano Carranza",null,null,null,null,null,null,null,null,"Tres Valles"]
[null,null,null,null,null,null,null,null,null,null,null,null,null,null,null,null,null,null,null,null,null,null,null,null,null,null,null,"San Juan Comaltepec","Vicente Guerrero",null,null,null,null,null,null,null,null,"Tuxpan"]
[null,null,null,null,null,null,null,null,null,null,null,null,null,null,null,null,null,null,null,null,null,null,null,null,null,null,null,"San Juan Cotzocón","Xayacatlán de Bravo",null,null,null,null,null,null,null,null,"Tuxtilla"]
[null,null,null,null,null,null,null,null,null,null,null,null,null,null,null,null,null,null,null,null,null,null,null,null,null,null,null,"San Juan de los Cués","Xicotepec",null,null,null,null,null,null,null,null,"Ursulo Galván"]
[null,null,null,null,null,null,null,null,null,null,null,null,null,null,null,null,null,null,null,null,null,null,null,null,null,null,null,"San Juan del Estado","Xicotlán",null,null,null,null,null,null,null,null,"Uxpanapa"]
[null,null,null,null,null,null,null,null,null,null,null,null,null,null,null,null,null,null,null,null,null,null,null,null,null,null,null,"San Juan del Río","Xiutetelco",null,null,null,null,null,null,null,null,"Vega de Alatorre"]
[null,null,null,null,null,null,null,null,null,null,null,null,null,null,null,null,null,null,null,null,null,null,null,null,null,null,null,"San Juan Diuxi","Xochiapulco",null,null,null,null,null,null,null,null,"Veracruz"]
[null,null,null,null,null,null,null,null,null,null,null,null,null,null,null,null,null,null,null,null,null,null,null,null,null,null,null,"San Juan Evangelista Analco","Xochiltepec",null,null,null,null,null,null,null,null,"Villa Aldama"]
[null,null,null,null,null,null,null,null,null,null,null,null,null,null,null,null,null,null,null,null,null,null,null,null,null,null,null,"San Juan Guelavía","Xochitlán de Vicente Suárez",null,null,null,null,null,null,null,null,"Xalapa"]
[null,null,null,null,null,null,null,null,null,null,null,null,null,null,null,null,null,null,null,null,null,null,null,null,null,null,null,"San Juan Guichicovi","Xochitlán Todos Santos",null,null,null,null,null,null,null,null,"Xico"]
[null,null,null,null,null,null,null,null,null,null,null,null,null,null,null,null,null,null,null,null,null,null,null,null,null,null,null,"San Juan Ihualtepec","Yaonáhuac",null,null,null,null,null,null,null,null,"Xoxocotla"]
[null,null,null,null,null,null,null,null,null,null,null,null,null,null,null,null,null,null,null,null,null,null,null,null,null,null,null,"San Juan Juquila Mixes","Yehualtepec",null,null,null,null,null,null,null,null,"Yanga"]
[null,null,null,null,null,null,null,null,null,null,null,null,null,null,null,null,null,null,null,null,null,null,null,null,null,null,null,"San Juan Juquila Vijanos","Zacapala",null,null,null,null,null,null,null,null,"Yecuatla"]
[null,null,null,null,null,null,null,null,null,null,null,null,null,null,null,null,null,null,null,null,null,null,null,null,null,null,null,"San Juan Lachao","Zacapoaxtla",null,null,null,null,null,null,null,null,"Zacualpan"]
[null,null,null,null,null,null,null,null,null,null,null,null,null,null,null,null,null,null,null,null,null,null,null,null,null,null,null,"San Juan Lachigalla","Zacatlán",null,null,null,null,null,null,null,null,"Zaragoza"]
[null,null,null,null,null,null,null,null,null,null,null,null,null,null,null,null,null,null,null,null,null,null,null,null,null,null,null,"San Juan Lajarcia","Zapotitlán",null,null,null,null,null,null,null,null,"Zentla"]
[null,null,null,null,null,null,null,null,null,null,null,null,null,null,null,null,null,null,null,null,null,null,null,null,null,null,null,"San Juan Lalana","Zapotitlán de Méndez",null,null,null,null,null,null,null,null,"Zongolica"]
[null,null,null,null,null,null,null,null,null,null,null,null,null,null,null,null,null,null,null,null,null,null,null,null,null,null,null,"San Juan Mazatlán","Zaragoza",null,null,null,null,null,null,null,null,"Zontecomatlán de López y Fuentes"]
[null,null,null,null,null,null,null,null,null,null,null,null,null,null,null,null,null,null,null,null,null,null,null,null,null,null,null,"San Juan Mixtepec","Zautla",null,null,null,null,null,null,null,null,"Zozocolco de Hidalgo"]
[null,null,null,null,null,null,null,null,null,null,null,null,null,null,null,null,null,null,null,null,null,null,null,null,null,null,null,"San Juan Mixtepec.","Zihuateutla"]
[null,null,null,null,null,null,null,null,null,null,null,null,null,null,null,null,null,null,null,null,null,null,null,null,null,null,null,"San Juan Ñumí","Zinacatepec"]
[null,null,null,null,null,null,null,null,null,null,null,null,null,null,null,null,null,null,null,null,null,null,null,null,null,null,null,"San Juan Ozolotepec","Zongozotla"]
[null,null,null,null,null,null,null,null,null,null,null,null,null,null,null,null,null,null,null,null,null,null,null,null,null,null,null,"San Juan Petlapa","Zoquiapan"]
[null,null,null,null,null,null,null,null,null,null,null,null,null,null,null,null,null,null,null,null,null,null,null,null,null,null,null,"San Juan Quiahije","Zoquitlán"]
[null,null,null,null,null,null,null,null,null,null,null,null,null,null,null,null,null,null,null,null,null,null,null,null,null,null,null,"San Juan Quiotepec"]
[null,null,null,null,null,null,null,null,null,null,null,null,null,null,null,null,null,null,null,null,null,null,null,null,null,null,null,"San Juan Sayultepec"]
[null,null,null,null,null,null,null,null,null,null,null,null,null,null,null,null,null,null,null,null,null,null,null,null,null,null,null,"San Juan Tabaá"]
[null,null,null,null,null,null,null,null,null,null,null,null,null,null,null,null,null,null,null,null,null,null,null,null,null,null,null,"San Juan Tamazola"]
[null,null,null,null,null,null,null,null,null,null,null,null,null,null,null,null,null,null,null,null,null,null,null,null,null,null,null,"San Juan Teita"]
[null,null,null,null,null,null,null,null,null,null,null,null,null,null,null,null,null,null,null,null,null,null,null,null,null,null,null,"San Juan Teitipac"]
[null,null,null,null,null,null,null,null,null,null,null,null,null,null,null,null,null,null,null,null,null,null,null,null,null,null,null,"San Juan Tepeuxila"]
[null,null,null,null,null,null,null,null,null,null,null,null,null,null,null,null,null,null,null,null,null,null,null,null,null,null,null,"San Juan Teposcolula"]
[null,null,null,null,null,null,null,null,null,null,null,null,null,null,null,null,null,null,null,null,null,null,null,null,null,null,null,"San Juan Yaeé"]
[null,null,null,null,null,null,null,null,null,null,null,null,null,null,null,null,null,null,null,null,null,null,null,null,null,null,null,"San Juan Yatzona"]
[null,null,null,null,null,null,null,null,null,null,null,null,null,null,null,null,null,null,null,null,null,null,null,null,null,null,null,"San Juan Yucuita"]
[null,null,null,null,null,null,null,null,null,null,null,null,null,null,null,null,null,null,null,null,null,null,null,null,null,null,null,"San Lorenzo"]
[null,null,null,null,null,null,null,null,null,null,null,null,null,null,null,null,null,null,null,null,null,null,null,null,null,null,null,"San Lorenzo Albarradas"]
[null,null,null,null,null,null,null,null,null,null,null,null,null,null,null,null,null,null,null,null,null,null,null,null,null,null,null,"San Lorenzo Cacaotepec"]
[null,null,null,null,null,null,null,null,null,null,null,null,null,null,null,null,null,null,null,null,null,null,null,null,null,null,null,"San Lorenzo Cuaunecuiltitla"]
[null,null,null,null,null,null,null,null,null,null,null,null,null,null,null,null,null,null,null,null,null,null,null,null,null,null,null,"San Lorenzo Texmelúcan"]
[null,null,null,null,null,null,null,null,null,null,null,null,null,null,null,null,null,null,null,null,null,null,null,null,null,null,null,"San Lorenzo Victoria"]
[null,null,null,null,null,null,null,null,null,null,null,null,null,null,null,null,null,null,null,null,null,null,null,null,null,null,null,"San Lucas Camotlán"]
[null,null,null,null,null,null,null,null,null,null,null,null,null,null,null,null,null,null,null,null,null,null,null,null,null,null,null,"San Lucas Ojitlán"]
[null,null,null,null,null,null,null,null,null,null,null,null,null,null,null,null,null,null,null,null,null,null,null,null,null,null,null,"San Lucas Quiaviní"]
[null,null,null,null,null,null,null,null,null,null,null,null,null,null,null,null,null,null,null,null,null,null,null,null,null,null,null,"San Lucas Zoquiápam"]
[null,null,null,null,null,null,null,null,null,null,null,null,null,null,null,null,null,null,null,null,null,null,null,null,null,null,null,"San Luis Amatlán"]
[null,null,null,null,null,null,null,null,null,null,null,null,null,null,null,null,null,null,null,null,null,null,null,null,null,null,null,"San Marcial Ozolotepec"]
[null,null,null,null,null,null,null,null,null,null,null,null,null,null,null,null,null,null,null,null,null,null,null,null,null,null,null,"San Marcos Arteaga"]
[null,null,null,null,null,null,null,null,null,null,null,null,null,null,null,null,null,null,null,null,null,null,null,null,null,null,null,"San Martín de los Cansecos"]
[null,null,null,null,null,null,null,null,null,null,null,null,null,null,null,null,null,null,null,null,null,null,null,null,null,null,null,"San Martín Huamelúlpam"]
[null,null,null,null,null,null,null,null,null,null,null,null,null,null,null,null,null,null,null,null,null,null,null,null,null,null,null,"San Martín Itunyoso"]
[null,null,null,null,null,null,null,null,null,null,null,null,null,null,null,null,null,null,null,null,null,null,null,null,null,null,null,"San Martín Lachilá"]
[null,null,null,null,null,null,null,null,null,null,null,null,null,null,null,null,null,null,null,null,null,null,null,null,null,null,null,"San Martín Peras"]
[null,null,null,null,null,null,null,null,null,null,null,null,null,null,null,null,null,null,null,null,null,null,null,null,null,null,null,"San Martín Tilcajete"]
[null,null,null,null,null,null,null,null,null,null,null,null,null,null,null,null,null,null,null,null,null,null,null,null,null,null,null,"San Martín Toxpalan"]
[null,null,null,null,null,null,null,null,null,null,null,null,null,null,null,null,null,null,null,null,null,null,null,null,null,null,null,"San Martín Zacatepec"]
[null,null,null,null,null,null,null,null,null,null,null,null,null,null,null,null,null,null,null,null,null,null,null,null,null,null,null,"San Mateo Cajonos"]
[null,null,null,null,null,null,null,null,null,null,null,null,null,null,null,null,null,null,null,null,null,null,null,null,null,null,null,"San Mateo del Mar"]
[null,null,null,null,null,null,null,null,null,null,null,null,null,null,null,null,null,null,null,null,null,null,null,null,null,null,null,"San Mateo Etlatongo"]
[null,null,null,null,null,null,null,null,null,null,null,null,null,null,null,null,null,null,null,null,null,null,null,null,null,null,null,"San Mateo Nejápam"]
[null,null,null,null,null,null,null,null,null,null,null,null,null,null,null,null,null,null,null,null,null,null,null,null,null,null,null,"San Mateo Peñasco"]
[null,null,null,null,null,null,null,null,null,null,null,null,null,null,null,null,null,null,null,null,null,null,null,null,null,null,null,"San Mateo Piñas"]
[null,null,null,null,null,null,null,null,null,null,null,null,null,null,null,null,null,null,null,null,null,null,null,null,null,null,null,"San Mateo Río Hondo"]
[null,null,null,null,null,null,null,null,null,null,null,null,null,null,null,null,null,null,null,null,null,null,null,null,null,null,null,"San Mateo Sindihui"]
[null,null,null,null,null,null,null,null,null,null,null,null,null,null,null,null,null,null,null,null,null,null,null,null,null,null,null,"San Mateo Tlapiltepec"]
[null,null,null,null,null,null,null,null,null,null,null,null,null,null,null,null,null,null,null,null,null,null,null,null,null,null,null,"San Mateo Yoloxochitlán"]
[null,null,null,null,null,null,null,null,null,null,null,null,null,null,null,null,null,null,null,null,null,null,null,null,null,null,null,"San Mateo Yucutindoo"]
[null,null,null,null,null,null,null,null,null,null,null,null,null,null,null,null,null,null,null,null,null,null,null,null,null,null,null,"San Melchor Betaza"]
[null,null,null,null,null,null,null,null,null,null,null,null,null,null,null,null,null,null,null,null,null,null,null,null,null,null,null,"San Miguel Achiutla"]
[null,null,null,null,null,null,null,null,null,null,null,null,null,null,null,null,null,null,null,null,null,null,null,null,null,null,null,"San Miguel Ahuehuetitlán"]
[null,null,null,null,null,null,null,null,null,null,null,null,null,null,null,null,null,null,null,null,null,null,null,null,null,null,null,"San Miguel Aloápam"]
[null,null,null,null,null,null,null,null,null,null,null,null,null,null,null,null,null,null,null,null,null,null,null,null,null,null,null,"San Miguel Amatitlán"]
[null,null,null,null,null,null,null,null,null,null,null,null,null,null,null,null,null,null,null,null,null,null,null,null,null,null,null,"San Miguel Amatlán"]
[null,null,null,null,null,null,null,null,null,null,null,null,null,null,null,null,null,null,null,null,null,null,null,null,null,null,null,"San Miguel Chicahua"]
[null,null,null,null,null,null,null,null,null,null,null,null,null,null,null,null,null,null,null,null,null,null,null,null,null,null,null,"San Miguel Chimalapa"]
[null,null,null,null,null,null,null,null,null,null,null,null,null,null,null,null,null,null,null,null,null,null,null,null,null,null,null,"San Miguel Coatlán"]
[null,null,null,null,null,null,null,null,null,null,null,null,null,null,null,null,null,null,null,null,null,null,null,null,null,null,null,"San Miguel del Puerto"]
[null,null,null,null,null,null,null,null,null,null,null,null,null,null,null,null,null,null,null,null,null,null,null,null,null,null,null,"San Miguel del Río"]
[null,null,null,null,null,null,null,null,null,null,null,null,null,null,null,null,null,null,null,null,null,null,null,null,null,null,null,"San Miguel Ejutla"]
[null,null,null,null,null,null,null,null,null,null,null,null,null,null,null,null,null,null,null,null,null,null,null,null,null,null,null,"San Miguel el Grande"]
[null,null,null,null,null,null,null,null,null,null,null,null,null,null,null,null,null,null,null,null,null,null,null,null,null,null,null,"San Miguel Huautla"]
[null,null,null,null,null,null,null,null,null,null,null,null,null,null,null,null,null,null,null,null,null,null,null,null,null,null,null,"San Miguel Mixtepec"]
[null,null,null,null,null,null,null,null,null,null,null,null,null,null,null,null,null,null,null,null,null,null,null,null,null,null,null,"San Miguel Panixtlahuaca"]
[null,null,null,null,null,null,null,null,null,null,null,null,null,null,null,null,null,null,null,null,null,null,null,null,null,null,null,"San Miguel Peras"]
[null,null,null,null,null,null,null,null,null,null,null,null,null,null,null,null,null,null,null,null,null,null,null,null,null,null,null,"San Miguel Piedras"]
[null,null,null,null,null,null,null,null,null,null,null,null,null,null,null,null,null,null,null,null,null,null,null,null,null,null,null,"San Miguel Quetzaltepec"]
[null,null,null,null,null,null,null,null,null,null,null,null,null,null,null,null,null,null,null,null,null,null,null,null,null,null,null,"San Miguel Santa Flor"]
[null,null,null,null,null,null,null,null,null,null,null,null,null,null,null,null,null,null,null,null,null,null,null,null,null,null,null,"San Miguel Soyaltepec"]
[null,null,null,null,null,null,null,null,null,null,null,null,null,null,null,null,null,null,null,null,null,null,null,null,null,null,null,"San Miguel Suchixtepec"]
[null,null,null,null,null,null,null,null,null,null,null,null,null,null,null,null,null,null,null,null,null,null,null,null,null,null,null,"San Miguel Tecomatlán"]
[null,null,null,null,null,null,null,null,null,null,null,null,null,null,null,null,null,null,null,null,null,null,null,null,null,null,null,"San Miguel Tenango"]
[null,null,null,null,null,null,null,null,null,null,null,null,null,null,null,null,null,null,null,null,null,null,null,null,null,null,null,"San Miguel Tequixtepec"]
[null,null,null,null,null,null,null,null,null,null,null,null,null,null,null,null,null,null,null,null,null,null,null,null,null,null,null,"San Miguel Tilquiápam"]
[null,null,null,null,null,null,null,null,null,null,null,null,null,null,null,null,null,null,null,null,null,null,null,null,null,null,null,"San Miguel Tlacamama"]
[null,null,null,null,null,null,null,null,null,null,null,null,null,null,null,null,null,null,null,null,null,null,null,null,null,null,null,"San Miguel Tlacotepec"]
[null,null,null,null,null,null,null,null,null,null,null,null,null,null,null,null,null,null,null,null,null,null,null,null,null,null,null,"San Miguel Tulancingo"]
[null,null,null,null,null,null,null,null,null,null,null,null,null,null,null,null,null,null,null,null,null,null,null,null,null,null,null,"San Miguel Yotao"]
[null,null,null,null,null,null,null,null,null,null,null,null,null,null,null,null,null,null,null,null,null,null,null,null,null,null,null,"San Nicolás"]
[null,null,null,null,null,null,null,null,null,null,null,null,null,null,null,null,null,null,null,null,null,null,null,null,null,null,null,"San Nicolás Hidalgo"]
[null,null,null,null,null,null,null,null,null,null,null,null,null,null,null,null,null,null,null,null,null,null,null,null,null,null,null,"San Pablo Coatlán"]
[null,null,null,null,null,null,null,null,null,null,null,null,null,null,null,null,null,null,null,null,null,null,null,null,null,null,null,"San Pablo Cuatro Venados"]
[null,null,null,null,null,null,null,null,null,null,null,null,null,null,null,null,null,null,null,null,null,null,null,null,null,null,null,"San Pablo Etla"]
[null,null,null,null,null,null,null,null,null,null,null,null,null,null,null,null,null,null,null,null,null,null,null,null,null,null,null,"San Pablo Huitzo"]
[null,null,null,null,null,null,null,null,null,null,null,null,null,null,null,null,null,null,null,null,null,null,null,null,null,null,null,"San Pablo Huixtepec"]
[null,null,null,null,null,null,null,null,null,null,null,null,null,null,null,null,null,null,null,null,null,null,null,null,null,null,null,"San Pablo Macuiltianguis"]
[null,null,null,null,null,null,null,null,null,null,null,null,null,null,null,null,null,null,null,null,null,null,null,null,null,null,null,"San Pablo Tijaltepec"]
[null,null,null,null,null,null,null,null,null,null,null,null,null,null,null,null,null,null,null,null,null,null,null,null,null,null,null,"San Pablo Villa de Mitla"]
[null,null,null,null,null,null,null,null,null,null,null,null,null,null,null,null,null,null,null,null,null,null,null,null,null,null,null,"San Pablo Yaganiza"]
[null,null,null,null,null,null,null,null,null,null,null,null,null,null,null,null,null,null,null,null,null,null,null,null,null,null,null,"San Pedro Amuzgos"]
[null,null,null,null,null,null,null,null,null,null,null,null,null,null,null,null,null,null,null,null,null,null,null,null,null,null,null,"San Pedro Apóstol"]
[null,null,null,null,null,null,null,null,null,null,null,null,null,null,null,null,null,null,null,null,null,null,null,null,null,null,null,"San Pedro Atoyac"]
[null,null,null,null,null,null,null,null,null,null,null,null,null,null,null,null,null,null,null,null,null,null,null,null,null,null,null,"San Pedro Cajonos"]
[null,null,null,null,null,null,null,null,null,null,null,null,null,null,null,null,null,null,null,null,null,null,null,null,null,null,null,"San Pedro Comitancillo"]
[null,null,null,null,null,null,null,null,null,null,null,null,null,null,null,null,null,null,null,null,null,null,null,null,null,null,null,"San Pedro Coxcaltepec Cántaros"]
[null,null,null,null,null,null,null,null,null,null,null,null,null,null,null,null,null,null,null,null,null,null,null,null,null,null,null,"San Pedro el Alto"]
[null,null,null,null,null,null,null,null,null,null,null,null,null,null,null,null,null,null,null,null,null,null,null,null,null,null,null,"San Pedro Huamelula"]
[null,null,null,null,null,null,null,null,null,null,null,null,null,null,null,null,null,null,null,null,null,null,null,null,null,null,null,"San Pedro Huilotepec"]
[null,null,null,null,null,null,null,null,null,null,null,null,null,null,null,null,null,null,null,null,null,null,null,null,null,null,null,"San Pedro Ixcatlán"]
[null,null,null,null,null,null,null,null,null,null,null,null,null,null,null,null,null,null,null,null,null,null,null,null,null,null,null,"San Pedro Ixtlahuaca"]
[null,null,null,null,null,null,null,null,null,null,null,null,null,null,null,null,null,null,null,null,null,null,null,null,null,null,null,"San Pedro Jaltepetongo"]
[null,null,null,null,null,null,null,null,null,null,null,null,null,null,null,null,null,null,null,null,null,null,null,null,null,null,null,"San Pedro Jicayán"]
[null,null,null,null,null,null,null,null,null,null,null,null,null,null,null,null,null,null,null,null,null,null,null,null,null,null,null,"San Pedro Jocotipac"]
[null,null,null,null,null,null,null,null,null,null,null,null,null,null,null,null,null,null,null,null,null,null,null,null,null,null,null,"San Pedro Juchatengo"]
[null,null,null,null,null,null,null,null,null,null,null,null,null,null,null,null,null,null,null,null,null,null,null,null,null,null,null,"San Pedro Mártir"]
[null,null,null,null,null,null,null,null,null,null,null,null,null,null,null,null,null,null,null,null,null,null,null,null,null,null,null,"San Pedro Mártir Quiechapa"]
[null,null,null,null,null,null,null,null,null,null,null,null,null,null,null,null,null,null,null,null,null,null,null,null,null,null,null,"San Pedro Mártir Yucuxaco"]
[null,null,null,null,null,null,null,null,null,null,null,null,null,null,null,null,null,null,null,null,null,null,null,null,null,null,null,"San Pedro Mixtepec"]
[null,null,null,null,null,null,null,null,null,null,null,null,null,null,null,null,null,null,null,null,null,null,null,null,null,null,null,"San Pedro Mixtepec"]
[null,null,null,null,null,null,null,null,null,null,null,null,null,null,null,null,null,null,null,null,null,null,null,null,null,null,null,"San Pedro Molinos"]
[null,null,null,null,null,null,null,null,null,null,null,null,null,null,null,null,null,null,null,null,null,null,null,null,null,null,null,"San Pedro Nopala"]
[null,null,null,null,null,null,null,null,null,null,null,null,null,null,null,null,null,null,null,null,null,null,null,null,null,null,null,"San Pedro Ocopetatillo"]
[null,null,null,null,null,null,null,null,null,null,null,null,null,null,null,null,null,null,null,null,null,null,null,null,null,null,null,"San Pedro Ocotepec"]
[null,null,null,null,null,null,null,null,null,null,null,null,null,null,null,null,null,null,null,null,null,null,null,null,null,null,null,"San Pedro Pochutla"]
[null,null,null,null,null,null,null,null,null,null,null,null,null,null,null,null,null,null,null,null,null,null,null,null,null,null,null,"San Pedro Quiatoni"]
[null,null,null,null,null,null,null,null,null,null,null,null,null,null,null,null,null,null,null,null,null,null,null,null,null,null,null,"San Pedro Sochiápam"]
[null,null,null,null,null,null,null,null,null,null,null,null,null,null,null,null,null,null,null,null,null,null,null,null,null,null,null,"San Pedro Tapanatepec"]
[null,null,null,null,null,null,null,null,null,null,null,null,null,null,null,null,null,null,null,null,null,null,null,null,null,null,null,"San Pedro Taviche"]
[null,null,null,null,null,null,null,null,null,null,null,null,null,null,null,null,null,null,null,null,null,null,null,null,null,null,null,"San Pedro Teozacoalco"]
[null,null,null,null,null,null,null,null,null,null,null,null,null,null,null,null,null,null,null,null,null,null,null,null,null,null,null,"San Pedro Teutila"]
[null,null,null,null,null,null,null,null,null,null,null,null,null,null,null,null,null,null,null,null,null,null,null,null,null,null,null,"San Pedro Tidaá"]
[null,null,null,null,null,null,null,null,null,null,null,null,null,null,null,null,null,null,null,null,null,null,null,null,null,null,null,"San Pedro Topiltepec"]
[null,null,null,null,null,null,null,null,null,null,null,null,null,null,null,null,null,null,null,null,null,null,null,null,null,null,null,"San Pedro Totolápam"]
[null,null,null,null,null,null,null,null,null,null,null,null,null,null,null,null,null,null,null,null,null,null,null,null,null,null,null,"San Pedro y San Pablo Ayutla"]
[null,null,null,null,null,null,null,null,null,null,null,null,null,null,null,null,null,null,null,null,null,null,null,null,null,null,null,"San Pedro y San Pablo Teposcolula"]
[null,null,null,null,null,null,null,null,null,null,null,null,null,null,null,null,null,null,null,null,null,null,null,null,null,null,null,"San Pedro y San Pablo Tequixtepec"]
[null,null,null,null,null,null,null,null,null,null,null,null,null,null,null,null,null,null,null,null,null,null,null,null,null,null,null,"San Pedro Yaneri"]
[null,null,null,null,null,null,null,null,null,null,null,null,null,null,null,null,null,null,null,null,null,null,null,null,null,null,null,"San Pedro Yólox"]
[null,null,null,null,null,null,null,null,null,null,null,null,null,null,null,null,null,null,null,null,null,null,null,null,null,null,null,"San Pedro Yucunama"]
[null,null,null,null,null,null,null,null,null,null,null,null,null,null,null,null,null,null,null,null,null,null,null,null,null,null,null,"San Raymundo Jalpan"]
[null,null,null,null,null,null,null,null,null,null,null,null,null,null,null,null,null,null,null,null,null,null,null,null,null,null,null,"San Sebastián Abasolo"]
[null,null,null,null,null,null,null,null,null,null,null,null,null,null,null,null,null,null,null,null,null,null,null,null,null,null,null,"San Sebastián Coatlán"]
[null,null,null,null,null,null,null,null,null,null,null,null,null,null,null,null,null,null,null,null,null,null,null,null,null,null,null,"San Sebastián Ixcapa"]
[null,null,null,null,null,null,null,null,null,null,null,null,null,null,null,null,null,null,null,null,null,null,null,null,null,null,null,"San Sebastián Nicananduta"]
[null,null,null,null,null,null,null,null,null,null,null,null,null,null,null,null,null,null,null,null,null,null,null,null,null,null,null,"San Sebastián Río Hondo"]
[null,null,null,null,null,null,null,null,null,null,null,null,null,null,null,null,null,null,null,null,null,null,null,null,null,null,null,"San Sebastián Tecomaxtlahuaca"]
[null,null,null,null,null,null,null,null,null,null,null,null,null,null,null,null,null,null,null,null,null,null,null,null,null,null,null,"San Sebastián Teitipac"]
[null,null,null,null,null,null,null,null,null,null,null,null,null,null,null,null,null,null,null,null,null,null,null,null,null,null,null,"San Sebastián Tutla"]
[null,null,null,null,null,null,null,null,null,null,null,null,null,null,null,null,null,null,null,null,null,null,null,null,null,null,null,"San Simón Almolongas"]
[null,null,null,null,null,null,null,null,null,null,null,null,null,null,null,null,null,null,null,null,null,null,null,null,null,null,null,"San Simón Zahuatlán"]
[null,null,null,null,null,null,null,null,null,null,null,null,null,null,null,null,null,null,null,null,null,null,null,null,null,null,null,"San Vicente Coatlán"]
[null,null,null,null,null,null,null,null,null,null,null,null,null,null,null,null,null,null,null,null,null,null,null,null,null,null,null,"San Vicente Lachixío"]
[null,null,null,null,null,null,null,null,null,null,null,null,null,null,null,null,null,null,null,null,null,null,null,null,null,null,null,"San Vicente Nuñú"]
[null,null,null,null,null,null,null,null,null,null,null,null,null,null,null,null,null,null,null,null,null,null,null,null,null,null,null,"Santa Ana"]
[null,null,null,null,null,null,null,null,null,null,null,null,null,null,null,null,null,null,null,null,null,null,null,null,null,null,null,"Santa Ana Ateixtlahuaca"]
[null,null,null,null,null,null,null,null,null,null,null,null,null,null,null,null,null,null,null,null,null,null,null,null,null,null,null,"Santa Ana Cuauhtémoc"]
[null,null,null,null,null,null,null,null,null,null,null,null,null,null,null,null,null,null,null,null,null,null,null,null,null,null,null,"Santa Ana del Valle"]
[null,null,null,null,null,null,null,null,null,null,null,null,null,null,null,null,null,null,null,null,null,null,null,null,null,null,null,"Santa Ana Tavela"]
[null,null,null,null,null,null,null,null,null,null,null,null,null,null,null,null,null,null,null,null,null,null,null,null,null,null,null,"Santa Ana Tlapacoyan"]
[null,null,null,null,null,null,null,null,null,null,null,null,null,null,null,null,null,null,null,null,null,null,null,null,null,null,null,"Santa Ana Yareni"]
[null,null,null,null,null,null,null,null,null,null,null,null,null,null,null,null,null,null,null,null,null,null,null,null,null,null,null,"Santa Ana Zegache"]
[null,null,null,null,null,null,null,null,null,null,null,null,null,null,null,null,null,null,null,null,null,null,null,null,null,null,null,"Santa Catalina Quierí"]
[null,null,null,null,null,null,null,null,null,null,null,null,null,null,null,null,null,null,null,null,null,null,null,null,null,null,null,"Santa Catarina Cuixtla"]
[null,null,null,null,null,null,null,null,null,null,null,null,null,null,null,null,null,null,null,null,null,null,null,null,null,null,null,"Santa Catarina Ixtepeji"]
[null,null,null,null,null,null,null,null,null,null,null,null,null,null,null,null,null,null,null,null,null,null,null,null,null,null,null,"Santa Catarina Juquila"]
[null,null,null,null,null,null,null,null,null,null,null,null,null,null,null,null,null,null,null,null,null,null,null,null,null,null,null,"Santa Catarina Lachatao"]
[null,null,null,null,null,null,null,null,null,null,null,null,null,null,null,null,null,null,null,null,null,null,null,null,null,null,null,"Santa Catarina Loxicha"]
[null,null,null,null,null,null,null,null,null,null,null,null,null,null,null,null,null,null,null,null,null,null,null,null,null,null,null,"Santa Catarina Mechoacán"]
[null,null,null,null,null,null,null,null,null,null,null,null,null,null,null,null,null,null,null,null,null,null,null,null,null,null,null,"Santa Catarina Minas"]
[null,null,null,null,null,null,null,null,null,null,null,null,null,null,null,null,null,null,null,null,null,null,null,null,null,null,null,"Santa Catarina Quiané"]
[null,null,null,null,null,null,null,null,null,null,null,null,null,null,null,null,null,null,null,null,null,null,null,null,null,null,null,"Santa Catarina Quioquitani"]
[null,null,null,null,null,null,null,null,null,null,null,null,null,null,null,null,null,null,null,null,null,null,null,null,null,null,null,"Santa Catarina Tayata"]
[null,null,null,null,null,null,null,null,null,null,null,null,null,null,null,null,null,null,null,null,null,null,null,null,null,null,null,"Santa Catarina Ticuá"]
[null,null,null,null,null,null,null,null,null,null,null,null,null,null,null,null,null,null,null,null,null,null,null,null,null,null,null,"Santa Catarina Yosonotú"]
[null,null,null,null,null,null,null,null,null,null,null,null,null,null,null,null,null,null,null,null,null,null,null,null,null,null,null,"Santa Catarina Zapoquila"]
[null,null,null,null,null,null,null,null,null,null,null,null,null,null,null,null,null,null,null,null,null,null,null,null,null,null,null,"Santa Cruz Acatepec"]
[null,null,null,null,null,null,null,null,null,null,null,null,null,null,null,null,null,null,null,null,null,null,null,null,null,null,null,"Santa Cruz Amilpas"]
[null,null,null,null,null,null,null,null,null,null,null,null,null,null,null,null,null,null,null,null,null,null,null,null,null,null,null,"Santa Cruz de Bravo"]
[null,null,null,null,null,null,null,null,null,null,null,null,null,null,null,null,null,null,null,null,null,null,null,null,null,null,null,"Santa Cruz Itundujia"]
[null,null,null,null,null,null,null,null,null,null,null,null,null,null,null,null,null,null,null,null,null,null,null,null,null,null,null,"Santa Cruz Mixtepec"]
[null,null,null,null,null,null,null,null,null,null,null,null,null,null,null,null,null,null,null,null,null,null,null,null,null,null,null,"Santa Cruz Nundaco"]
[null,null,null,null,null,null,null,null,null,null,null,null,null,null,null,null,null,null,null,null,null,null,null,null,null,null,null,"Santa Cruz Papalutla"]
[null,null,null,null,null,null,null,null,null,null,null,null,null,null,null,null,null,null,null,null,null,null,null,null,null,null,null,"Santa Cruz Tacache de Mina"]
[null,null,null,null,null,null,null,null,null,null,null,null,null,null,null,null,null,null,null,null,null,null,null,null,null,null,null,"Santa Cruz Tacahua"]
[null,null,null,null,null,null,null,null,null,null,null,null,null,null,null,null,null,null,null,null,null,null,null,null,null,null,null,"Santa Cruz Tayata"]
[null,null,null,null,null,null,null,null,null,null,null,null,null,null,null,null,null,null,null,null,null,null,null,null,null,null,null,"Santa Cruz Xitla"]
[null,null,null,null,null,null,null,null,null,null,null,null,null,null,null,null,null,null,null,null,null,null,null,null,null,null,null,"Santa Cruz Xoxocotlán"]
[null,null,null,null,null,null,null,null,null,null,null,null,null,null,null,null,null,null,null,null,null,null,null,null,null,null,null,"Santa Cruz Zenzontepec"]
[null,null,null,null,null,null,null,null,null,null,null,null,null,null,null,null,null,null,null,null,null,null,null,null,null,null,null,"Santa Gertrudis"]
[null,null,null,null,null,null,null,null,null,null,null,null,null,null,null,null,null,null,null,null,null,null,null,null,null,null,null,"Santa Inés de Zaragoza"]
[null,null,null,null,null,null,null,null,null,null,null,null,null,null,null,null,null,null,null,null,null,null,null,null,null,null,null,"Santa Inés del Monte"]
[null,null,null,null,null,null,null,null,null,null,null,null,null,null,null,null,null,null,null,null,null,null,null,null,null,null,null,"Santa Inés Yatzeche"]
[null,null,null,null,null,null,null,null,null,null,null,null,null,null,null,null,null,null,null,null,null,null,null,null,null,null,null,"Santa Lucía del Camino"]
[null,null,null,null,null,null,null,null,null,null,null,null,null,null,null,null,null,null,null,null,null,null,null,null,null,null,null,"Santa Lucía Miahuatlán"]
[null,null,null,null,null,null,null,null,null,null,null,null,null,null,null,null,null,null,null,null,null,null,null,null,null,null,null,"Santa Lucía Monteverde"]
[null,null,null,null,null,null,null,null,null,null,null,null,null,null,null,null,null,null,null,null,null,null,null,null,null,null,null,"Santa Lucía Ocotlán"]
[null,null,null,null,null,null,null,null,null,null,null,null,null,null,null,null,null,null,null,null,null,null,null,null,null,null,null,"Santa Magdalena Jicotlán"]
[null,null,null,null,null,null,null,null,null,null,null,null,null,null,null,null,null,null,null,null,null,null,null,null,null,null,null,"Santa María Alotepec"]
[null,null,null,null,null,null,null,null,null,null,null,null,null,null,null,null,null,null,null,null,null,null,null,null,null,null,null,"Santa María Apazco"]
[null,null,null,null,null,null,null,null,null,null,null,null,null,null,null,null,null,null,null,null,null,null,null,null,null,null,null,"Santa María Atzompa"]
[null,null,null,null,null,null,null,null,null,null,null,null,null,null,null,null,null,null,null,null,null,null,null,null,null,null,null,"Santa María Camotlán"]
[null,null,null,null,null,null,null,null,null,null,null,null,null,null,null,null,null,null,null,null,null,null,null,null,null,null,null,"Santa María Chachoápam"]
[null,null,null,null,null,null,null,null,null,null,null,null,null,null,null,null,null,null,null,null,null,null,null,null,null,null,null,"Santa María Chilchotla"]
[null,null,null,null,null,null,null,null,null,null,null,null,null,null,null,null,null,null,null,null,null,null,null,null,null,null,null,"Santa María Chimalapa"]
[null,null,null,null,null,null,null,null,null,null,null,null,null,null,null,null,null,null,null,null,null,null,null,null,null,null,null,"Santa María Colotepec"]
[null,null,null,null,null,null,null,null,null,null,null,null,null,null,null,null,null,null,null,null,null,null,null,null,null,null,null,"Santa María Cortijo"]
[null,null,null,null,null,null,null,null,null,null,null,null,null,null,null,null,null,null,null,null,null,null,null,null,null,null,null,"Santa María Coyotepec"]
[null,null,null,null,null,null,null,null,null,null,null,null,null,null,null,null,null,null,null,null,null,null,null,null,null,null,null,"Santa María del Rosario"]
[null,null,null,null,null,null,null,null,null,null,null,null,null,null,null,null,null,null,null,null,null,null,null,null,null,null,null,"Santa María del Tule"]
[null,null,null,null,null,null,null,null,null,null,null,null,null,null,null,null,null,null,null,null,null,null,null,null,null,null,null,"Santa María Ecatepec"]
[null,null,null,null,null,null,null,null,null,null,null,null,null,null,null,null,null,null,null,null,null,null,null,null,null,null,null,"Santa María Guelacé"]
[null,null,null,null,null,null,null,null,null,null,null,null,null,null,null,null,null,null,null,null,null,null,null,null,null,null,null,"Santa María Guienagati"]
[null,null,null,null,null,null,null,null,null,null,null,null,null,null,null,null,null,null,null,null,null,null,null,null,null,null,null,"Santa María Huatulco"]
[null,null,null,null,null,null,null,null,null,null,null,null,null,null,null,null,null,null,null,null,null,null,null,null,null,null,null,"Santa María Huazolotitlán"]
[null,null,null,null,null,null,null,null,null,null,null,null,null,null,null,null,null,null,null,null,null,null,null,null,null,null,null,"Santa María Ipalapa"]
[null,null,null,null,null,null,null,null,null,null,null,null,null,null,null,null,null,null,null,null,null,null,null,null,null,null,null,"Santa María Ixcatlán"]
[null,null,null,null,null,null,null,null,null,null,null,null,null,null,null,null,null,null,null,null,null,null,null,null,null,null,null,"Santa María Jacatepec"]
[null,null,null,null,null,null,null,null,null,null,null,null,null,null,null,null,null,null,null,null,null,null,null,null,null,null,null,"Santa María Jalapa del Marqués"]
[null,null,null,null,null,null,null,null,null,null,null,null,null,null,null,null,null,null,null,null,null,null,null,null,null,null,null,"Santa María Jaltianguis"]
[null,null,null,null,null,null,null,null,null,null,null,null,null,null,null,null,null,null,null,null,null,null,null,null,null,null,null,"Santa María la Asunción"]
[null,null,null,null,null,null,null,null,null,null,null,null,null,null,null,null,null,null,null,null,null,null,null,null,null,null,null,"Santa María Lachixío"]
[null,null,null,null,null,null,null,null,null,null,null,null,null,null,null,null,null,null,null,null,null,null,null,null,null,null,null,"Santa María Mixtequilla"]
[null,null,null,null,null,null,null,null,null,null,null,null,null,null,null,null,null,null,null,null,null,null,null,null,null,null,null,"Santa María Nativitas"]
[null,null,null,null,null,null,null,null,null,null,null,null,null,null,null,null,null,null,null,null,null,null,null,null,null,null,null,"Santa María Nduayaco"]
[null,null,null,null,null,null,null,null,null,null,null,null,null,null,null,null,null,null,null,null,null,null,null,null,null,null,null,"Santa María Ozolotepec"]
[null,null,null,null,null,null,null,null,null,null,null,null,null,null,null,null,null,null,null,null,null,null,null,null,null,null,null,"Santa María Pápalo"]
[null,null,null,null,null,null,null,null,null,null,null,null,null,null,null,null,null,null,null,null,null,null,null,null,null,null,null,"Santa María Peñoles"]
[null,null,null,null,null,null,null,null,null,null,null,null,null,null,null,null,null,null,null,null,null,null,null,null,null,null,null,"Santa María Petapa"]
[null,null,null,null,null,null,null,null,null,null,null,null,null,null,null,null,null,null,null,null,null,null,null,null,null,null,null,"Santa María Quiegolani"]
[null,null,null,null,null,null,null,null,null,null,null,null,null,null,null,null,null,null,null,null,null,null,null,null,null,null,null,"Santa María Sola"]
[null,null,null,null,null,null,null,null,null,null,null,null,null,null,null,null,null,null,null,null,null,null,null,null,null,null,null,"Santa María Tataltepec"]
[null,null,null,null,null,null,null,null,null,null,null,null,null,null,null,null,null,null,null,null,null,null,null,null,null,null,null,"Santa María Tecomavaca"]
[null,null,null,null,null,null,null,null,null,null,null,null,null,null,null,null,null,null,null,null,null,null,null,null,null,null,null,"Santa María Temaxcalapa"]
[null,null,null,null,null,null,null,null,null,null,null,null,null,null,null,null,null,null,null,null,null,null,null,null,null,null,null,"Santa María Temaxcaltepec"]
[null,null,null,null,null,null,null,null,null,null,null,null,null,null,null,null,null,null,null,null,null,null,null,null,null,null,null,"Santa María Teopoxco"]
[null,null,null,null,null,null,null,null,null,null,null,null,null,null,null,null,null,null,null,null,null,null,null,null,null,null,null,"Santa María Tepantlali"]
[null,null,null,null,null,null,null,null,null,null,null,null,null,null,null,null,null,null,null,null,null,null,null,null,null,null,null,"Santa María Texcatitlán"]
[null,null,null,null,null,null,null,null,null,null,null,null,null,null,null,null,null,null,null,null,null,null,null,null,null,null,null,"Santa María Tlahuitoltepec"]
[null,null,null,null,null,null,null,null,null,null,null,null,null,null,null,null,null,null,null,null,null,null,null,null,null,null,null,"Santa María Tlalixtac"]
[null,null,null,null,null,null,null,null,null,null,null,null,null,null,null,null,null,null,null,null,null,null,null,null,null,null,null,"Santa María Tonameca"]
[null,null,null,null,null,null,null,null,null,null,null,null,null,null,null,null,null,null,null,null,null,null,null,null,null,null,null,"Santa María Totolapilla"]
[null,null,null,null,null,null,null,null,null,null,null,null,null,null,null,null,null,null,null,null,null,null,null,null,null,null,null,"Santa María Xadani"]
[null,null,null,null,null,null,null,null,null,null,null,null,null,null,null,null,null,null,null,null,null,null,null,null,null,null,null,"Santa María Yalina"]
[null,null,null,null,null,null,null,null,null,null,null,null,null,null,null,null,null,null,null,null,null,null,null,null,null,null,null,"Santa María Yavesía"]
[null,null,null,null,null,null,null,null,null,null,null,null,null,null,null,null,null,null,null,null,null,null,null,null,null,null,null,"Santa María Yolotepec"]
[null,null,null,null,null,null,null,null,null,null,null,null,null,null,null,null,null,null,null,null,null,null,null,null,null,null,null,"Santa María Yosoyúa"]
[null,null,null,null,null,null,null,null,null,null,null,null,null,null,null,null,null,null,null,null,null,null,null,null,null,null,null,"Santa María Yucuhiti"]
[null,null,null,null,null,null,null,null,null,null,null,null,null,null,null,null,null,null,null,null,null,null,null,null,null,null,null,"Santa María Zacatepec"]
[null,null,null,null,null,null,null,null,null,null,null,null,null,null,null,null,null,null,null,null,null,null,null,null,null,null,null,"Santa María Zaniza"]
[null,null,null,null,null,null,null,null,null,null,null,null,null,null,null,null,null,null,null,null,null,null,null,null,null,null,null,"Santa María Zoquitlán"]
[null,null,null,null,null,null,null,null,null,null,null,null,null,null,null,null,null,null,null,null,null,null,null,null,null,null,null,"Santiago Amoltepec"]
[null,null,null,null,null,null,null,null,null,null,null,null,null,null,null,null,null,null,null,null,null,null,null,null,null,null,null,"Santiago Apoala"]
[null,null,null,null,null,null,null,null,null,null,null,null,null,null,null,null,null,null,null,null,null,null,null,null,null,null,null,"Santiago Apóstol"]
[null,null,null,null,null,null,null,null,null,null,null,null,null,null,null,null,null,null,null,null,null,null,null,null,null,null,null,"Santiago Astata"]
[null,null,null,null,null,null,null,null,null,null,null,null,null,null,null,null,null,null,null,null,null,null,null,null,null,null,null,"Santiago Atitlán"]
[null,null,null,null,null,null,null,null,null,null,null,null,null,null,null,null,null,null,null,null,null,null,null,null,null,null,null,"Santiago Ayuquililla"]
[null,null,null,null,null,null,null,null,null,null,null,null,null,null,null,null,null,null,null,null,null,null,null,null,null,null,null,"Santiago Cacaloxtepec"]
[null,null,null,null,null,null,null,null,null,null,null,null,null,null,null,null,null,null,null,null,null,null,null,null,null,null,null,"Santiago Camotlán"]
[null,null,null,null,null,null,null,null,null,null,null,null,null,null,null,null,null,null,null,null,null,null,null,null,null,null,null,"Santiago Choápam"]
[null,null,null,null,null,null,null,null,null,null,null,null,null,null,null,null,null,null,null,null,null,null,null,null,null,null,null,"Santiago Comaltepec"]
[null,null,null,null,null,null,null,null,null,null,null,null,null,null,null,null,null,null,null,null,null,null,null,null,null,null,null,"Santiago del Río"]
[null,null,null,null,null,null,null,null,null,null,null,null,null,null,null,null,null,null,null,null,null,null,null,null,null,null,null,"Santiago Huajolotitlán"]
[null,null,null,null,null,null,null,null,null,null,null,null,null,null,null,null,null,null,null,null,null,null,null,null,null,null,null,"Santiago Huauclilla"]
[null,null,null,null,null,null,null,null,null,null,null,null,null,null,null,null,null,null,null,null,null,null,null,null,null,null,null,"Santiago Ihuitlán Plumas"]
[null,null,null,null,null,null,null,null,null,null,null,null,null,null,null,null,null,null,null,null,null,null,null,null,null,null,null,"Santiago Ixcuintepec"]
[null,null,null,null,null,null,null,null,null,null,null,null,null,null,null,null,null,null,null,null,null,null,null,null,null,null,null,"Santiago Ixtayutla"]
[null,null,null,null,null,null,null,null,null,null,null,null,null,null,null,null,null,null,null,null,null,null,null,null,null,null,null,"Santiago Jamiltepec"]
[null,null,null,null,null,null,null,null,null,null,null,null,null,null,null,null,null,null,null,null,null,null,null,null,null,null,null,"Santiago Jocotepec"]
[null,null,null,null,null,null,null,null,null,null,null,null,null,null,null,null,null,null,null,null,null,null,null,null,null,null,null,"Santiago Juxtlahuaca"]
[null,null,null,null,null,null,null,null,null,null,null,null,null,null,null,null,null,null,null,null,null,null,null,null,null,null,null,"Santiago Lachiguiri"]
[null,null,null,null,null,null,null,null,null,null,null,null,null,null,null,null,null,null,null,null,null,null,null,null,null,null,null,"Santiago Lalopa"]
[null,null,null,null,null,null,null,null,null,null,null,null,null,null,null,null,null,null,null,null,null,null,null,null,null,null,null,"Santiago Laollaga"]
[null,null,null,null,null,null,null,null,null,null,null,null,null,null,null,null,null,null,null,null,null,null,null,null,null,null,null,"Santiago Laxopa"]
[null,null,null,null,null,null,null,null,null,null,null,null,null,null,null,null,null,null,null,null,null,null,null,null,null,null,null,"Santiago Llano Grande"]
[null,null,null,null,null,null,null,null,null,null,null,null,null,null,null,null,null,null,null,null,null,null,null,null,null,null,null,"Santiago Matatlán"]
[null,null,null,null,null,null,null,null,null,null,null,null,null,null,null,null,null,null,null,null,null,null,null,null,null,null,null,"Santiago Miltepec"]
[null,null,null,null,null,null,null,null,null,null,null,null,null,null,null,null,null,null,null,null,null,null,null,null,null,null,null,"Santiago Minas"]
[null,null,null,null,null,null,null,null,null,null,null,null,null,null,null,null,null,null,null,null,null,null,null,null,null,null,null,"Santiago Nacaltepec"]
[null,null,null,null,null,null,null,null,null,null,null,null,null,null,null,null,null,null,null,null,null,null,null,null,null,null,null,"Santiago Nejapilla"]
[null,null,null,null,null,null,null,null,null,null,null,null,null,null,null,null,null,null,null,null,null,null,null,null,null,null,null,"Santiago Niltepec"]
[null,null,null,null,null,null,null,null,null,null,null,null,null,null,null,null,null,null,null,null,null,null,null,null,null,null,null,"Santiago Nundiche"]
[null,null,null,null,null,null,null,null,null,null,null,null,null,null,null,null,null,null,null,null,null,null,null,null,null,null,null,"Santiago Nuyoó"]
[null,null,null,null,null,null,null,null,null,null,null,null,null,null,null,null,null,null,null,null,null,null,null,null,null,null,null,"Santiago Pinotepa Nacional"]
[null,null,null,null,null,null,null,null,null,null,null,null,null,null,null,null,null,null,null,null,null,null,null,null,null,null,null,"Santiago Suchilquitongo"]
[null,null,null,null,null,null,null,null,null,null,null,null,null,null,null,null,null,null,null,null,null,null,null,null,null,null,null,"Santiago Tamazola"]
[null,null,null,null,null,null,null,null,null,null,null,null,null,null,null,null,null,null,null,null,null,null,null,null,null,null,null,"Santiago Tapextla"]
[null,null,null,null,null,null,null,null,null,null,null,null,null,null,null,null,null,null,null,null,null,null,null,null,null,null,null,"Santiago Tenango"]
[null,null,null,null,null,null,null,null,null,null,null,null,null,null,null,null,null,null,null,null,null,null,null,null,null,null,null,"Santiago Tepetlapa"]
[null,null,null,null,null,null,null,null,null,null,null,null,null,null,null,null,null,null,null,null,null,null,null,null,null,null,null,"Santiago Tetepec"]
[null,null,null,null,null,null,null,null,null,null,null,null,null,null,null,null,null,null,null,null,null,null,null,null,null,null,null,"Santiago Texcalcingo"]
[null,null,null,null,null,null,null,null,null,null,null,null,null,null,null,null,null,null,null,null,null,null,null,null,null,null,null,"Santiago Textitlán"]
[null,null,null,null,null,null,null,null,null,null,null,null,null,null,null,null,null,null,null,null,null,null,null,null,null,null,null,"Santiago Tilantongo"]
[null,null,null,null,null,null,null,null,null,null,null,null,null,null,null,null,null,null,null,null,null,null,null,null,null,null,null,"Santiago Tillo"]
[null,null,null,null,null,null,null,null,null,null,null,null,null,null,null,null,null,null,null,null,null,null,null,null,null,null,null,"Santiago Tlazoyaltepec"]
[null,null,null,null,null,null,null,null,null,null,null,null,null,null,null,null,null,null,null,null,null,null,null,null,null,null,null,"Santiago Xanica"]
[null,null,null,null,null,null,null,null,null,null,null,null,null,null,null,null,null,null,null,null,null,null,null,null,null,null,null,"Santiago Xiacuí"]
[null,null,null,null,null,null,null,null,null,null,null,null,null,null,null,null,null,null,null,null,null,null,null,null,null,null,null,"Santiago Yaitepec"]
[null,null,null,null,null,null,null,null,null,null,null,null,null,null,null,null,null,null,null,null,null,null,null,null,null,null,null,"Santiago Yaveo"]
[null,null,null,null,null,null,null,null,null,null,null,null,null,null,null,null,null,null,null,null,null,null,null,null,null,null,null,"Santiago Yolomécatl"]
[null,null,null,null,null,null,null,null,null,null,null,null,null,null,null,null,null,null,null,null,null,null,null,null,null,null,null,"Santiago Yosondúa"]
[null,null,null,null,null,null,null,null,null,null,null,null,null,null,null,null,null,null,null,null,null,null,null,null,null,null,null,"Santiago Yucuyachi"]
[null,null,null,null,null,null,null,null,null,null,null,null,null,null,null,null,null,null,null,null,null,null,null,null,null,null,null,"Santiago Zacatepec"]
[null,null,null,null,null,null,null,null,null,null,null,null,null,null,null,null,null,null,null,null,null,null,null,null,null,null,null,"Santiago Zoochila"]
[null,null,null,null,null,null,null,null,null,null,null,null,null,null,null,null,null,null,null,null,null,null,null,null,null,null,null,"Santo Domingo Albarradas"]
[null,null,null,null,null,null,null,null,null,null,null,null,null,null,null,null,null,null,null,null,null,null,null,null,null,null,null,"Santo Domingo Armenta"]
[null,null,null,null,null,null,null,null,null,null,null,null,null,null,null,null,null,null,null,null,null,null,null,null,null,null,null,"Santo Domingo Chihuitán"]
[null,null,null,null,null,null,null,null,null,null,null,null,null,null,null,null,null,null,null,null,null,null,null,null,null,null,null,"Santo Domingo de Morelos"]
[null,null,null,null,null,null,null,null,null,null,null,null,null,null,null,null,null,null,null,null,null,null,null,null,null,null,null,"Santo Domingo Ingenio"]
[null,null,null,null,null,null,null,null,null,null,null,null,null,null,null,null,null,null,null,null,null,null,null,null,null,null,null,"Santo Domingo Ixcatlán"]
[null,null,null,null,null,null,null,null,null,null,null,null,null,null,null,null,null,null,null,null,null,null,null,null,null,null,null,"Santo Domingo Nuxaá"]
[null,null,null,null,null,null,null,null,null,null,null,null,null,null,null,null,null,null,null,null,null,null,null,null,null,null,null,"Santo Domingo Ozolotepec"]
[null,null,null,null,null,null,null,null,null,null,null,null,null,null,null,null,null,null,null,null,null,null,null,null,null,null,null,"Santo Domingo Petapa"]
[null,null,null,null,null,null,null,null,null,null,null,null,null,null,null,null,null,null,null,null,null,null,null,null,null,null,null,"Santo Domingo Roayaga"]
[null,null,null,null,null,null,null,null,null,null,null,null,null,null,null,null,null,null,null,null,null,null,null,null,null,null,null,"Santo Domingo Tehuantepec"]
[null,null,null,null,null,null,null,null,null,null,null,null,null,null,null,null,null,null,null,null,null,null,null,null,null,null,null,"Santo Domingo Teojomulco"]
[null,null,null,null,null,null,null,null,null,null,null,null,null,null,null,null,null,null,null,null,null,null,null,null,null,null,null,"Santo Domingo Tepuxtepec"]
[null,null,null,null,null,null,null,null,null,null,null,null,null,null,null,null,null,null,null,null,null,null,null,null,null,null,null,"Santo Domingo Tlatayápam"]
[null,null,null,null,null,null,null,null,null,null,null,null,null,null,null,null,null,null,null,null,null,null,null,null,null,null,null,"Santo Domingo Tomaltepec"]
[null,null,null,null,null,null,null,null,null,null,null,null,null,null,null,null,null,null,null,null,null,null,null,null,null,null,null,"Santo Domingo Tonalá"]
[null,null,null,null,null,null,null,null,null,null,null,null,null,null,null,null,null,null,null,null,null,null,null,null,null,null,null,"Santo Domingo Tonaltepec"]
[null,null,null,null,null,null,null,null,null,null,null,null,null,null,null,null,null,null,null,null,null,null,null,null,null,null,null,"Santo Domingo Xagacía"]
[null,null,null,null,null,null,null,null,null,null,null,null,null,null,null,null,null,null,null,null,null,null,null,null,null,null,null,"Santo Domingo Yanhuitlán"]
[null,null,null,null,null,null,null,null,null,null,null,null,null,null,null,null,null,null,null,null,null,null,null,null,null,null,null,"Santo Domingo Yodohino"]
[null,null,null,null,null,null,null,null,null,null,null,null,null,null,null,null,null,null,null,null,null,null,null,null,null,null,null,"Santo Domingo Zanatepec"]
[null,null,null,null,null,null,null,null,null,null,null,null,null,null,null,null,null,null,null,null,null,null,null,null,null,null,null,"Santo Tomás Jalieza"]
[null,null,null,null,null,null,null,null,null,null,null,null,null,null,null,null,null,null,null,null,null,null,null,null,null,null,null,"Santo Tomás Mazaltepec"]
[null,null,null,null,null,null,null,null,null,null,null,null,null,null,null,null,null,null,null,null,null,null,null,null,null,null,null,"Santo Tomás Ocotepec"]
[null,null,null,null,null,null,null,null,null,null,null,null,null,null,null,null,null,null,null,null,null,null,null,null,null,null,null,"Santo Tomás Tamazulapan"]
[null,null,null,null,null,null,null,null,null,null,null,null,null,null,null,null,null,null,null,null,null,null,null,null,null,null,null,"Santos Reyes Nopala"]
[null,null,null,null,null,null,null,null,null,null,null,null,null,null,null,null,null,null,null,null,null,null,null,null,null,null,null,"Santos Reyes Pápalo"]
[null,null,null,null,null,null,null,null,null,null,null,null,null,null,null,null,null,null,null,null,null,null,null,null,null,null,null,"Santos Reyes Tepejillo"]
[null,null,null,null,null,null,null,null,null,null,null,null,null,null,null,null,null,null,null,null,null,null,null,null,null,null,null,"Santos Reyes Yucuná"]
[null,null,null,null,null,null,null,null,null,null,null,null,null,null,null,null,null,null,null,null,null,null,null,null,null,null,null,"Silacayoápam"]
[null,null,null,null,null,null,null,null,null,null,null,null,null,null,null,null,null,null,null,null,null,null,null,null,null,null,null,"Sitio de Xitlapehua"]
[null,null,null,null,null,null,null,null,null,null,null,null,null,null,null,null,null,null,null,null,null,null,null,null,null,null,null,"Soledad Etla"]
[null,null,null,null,null,null,null,null,null,null,null,null,null,null,null,null,null,null,null,null,null,null,null,null,null,null,null,"Tamazulápam del Espíritu Santo"]
[null,null,null,null,null,null,null,null,null,null,null,null,null,null,null,null,null,null,null,null,null,null,null,null,null,null,null,"Tanetze de Zaragoza"]
[null,null,null,null,null,null,null,null,null,null,null,null,null,null,null,null,null,null,null,null,null,null,null,null,null,null,null,"Taniche"]
[null,null,null,null,null,null,null,null,null,null,null,null,null,null,null,null,null,null,null,null,null,null,null,null,null,null,null,"Tataltepec de Valdés"]
[null,null,null,null,null,null,null,null,null,null,null,null,null,null,null,null,null,null,null,null,null,null,null,null,null,null,null,"Teococuilco de Marcos Pérez"]
[null,null,null,null,null,null,null,null,null,null,null,null,null,null,null,null,null,null,null,null,null,null,null,null,null,null,null,"Teotitlán de Flores Magón"]
[null,null,null,null,null,null,null,null,null,null,null,null,null,null,null,null,null,null,null,null,null,null,null,null,null,null,null,"Teotitlán del Valle"]
[null,null,null,null,null,null,null,null,null,null,null,null,null,null,null,null,null,null,null,null,null,null,null,null,null,null,null,"Teotongo"]
[null,null,null,null,null,null,null,null,null,null,null,null,null,null,null,null,null,null,null,null,null,null,null,null,null,null,null,"Tepelmeme Villa de Morelos"]
[null,null,null,null,null,null,null,null,null,null,null,null,null,null,null,null,null,null,null,null,null,null,null,null,null,null,null,"Tlacolula de Matamoros"]
[null,null,null,null,null,null,null,null,null,null,null,null,null,null,null,null,null,null,null,null,null,null,null,null,null,null,null,"Tlacotepec Plumas"]
[null,null,null,null,null,null,null,null,null,null,null,null,null,null,null,null,null,null,null,null,null,null,null,null,null,null,null,"Tlalixtac de Cabrera"]
[null,null,null,null,null,null,null,null,null,null,null,null,null,null,null,null,null,null,null,null,null,null,null,null,null,null,null,"Totontepec Villa de Morelos"]
[null,null,null,null,null,null,null,null,null,null,null,null,null,null,null,null,null,null,null,null,null,null,null,null,null,null,null,"Trinidad Zaachila"]
[null,null,null,null,null,null,null,null,null,null,null,null,null,null,null,null,null,null,null,null,null,null,null,null,null,null,null,"Unión Hidalgo"]
[null,null,null,null,null,null,null,null,null,null,null,null,null,null,null,null,null,null,null,null,null,null,null,null,null,null,null,"Valerio Trujano"]
[null,null,null,null,null,null,null,null,null,null,null,null,null,null,null,null,null,null,null,null,null,null,null,null,null,null,null,"Villa de Chilapa de Díaz"]
[null,null,null,null,null,null,null,null,null,null,null,null,null,null,null,null,null,null,null,null,null,null,null,null,null,null,null,"Villa de Etla"]
[null,null,null,null,null,null,null,null,null,null,null,null,null,null,null,null,null,null,null,null,null,null,null,null,null,null,null,"Villa de Santiago Chazumba"]
[null,null,null,null,null,null,null,null,null,null,null,null,null,null,null,null,null,null,null,null,null,null,null,null,null,null,null,"Villa de Tamazulápam del Progreso"]
[null,null,null,null,null,null,null,null,null,null,null,null,null,null,null,null,null,null,null,null,null,null,null,null,null,null,null,"Villa de Tututepec"]
[null,null,null,null,null,null,null,null,null,null,null,null,null,null,null,null,null,null,null,null,null,null,null,null,null,null,null,"Villa de Zaachila"]
[null,null,null,null,null,null,null,null,null,null,null,null,null,null,null,null,null,null,null,null,null,null,null,null,null,null,null,"Villa Díaz Ordaz"]
[null,null,null,null,null,null,null,null,null,null,null,null,null,null,null,null,null,null,null,null,null,null,null,null,null,null,null,"Villa Hidalgo"]
[null,null,null,null,null,null,null,null,null,null,null,null,null,null,null,null,null,null,null,null,null,null,null,null,null,null,null,"Villa Sola de Vega"]
[null,null,null,null,null,null,null,null,null,null,null,null,null,null,null,null,null,null,null,null,null,null,null,null,null,null,null,"Villa Talea de Castro"]
[null,null,null,null,null,null,null,null,null,null,null,null,null,null,null,null,null,null,null,null,null,null,null,null,null,null,null,"Villa Tejúpam de la Unión"]
[null,null,null,null,null,null,null,null,null,null,null,null,null,null,null,null,null,null,null,null,null,null,null,null,null,null,null,"Yaxe"]
[null,null,null,null,null,null,null,null,null,null,null,null,null,null,null,null,null,null,null,null,null,null,null,null,null,null,null,"Yogana"]
[null,null,null,null,null,null,null,null,null,null,null,null,null,null,null,null,null,null,null,null,null,null,null,null,null,null,null,"Yutanduchi de Guerrero"]
[null,null,null,null,null,null,null,null,null,null,null,null,null,null,null,null,null,null,null,null,null,null,null,null,null,null,null,"Zapotitlán Lagunas"]
[null,null,null,null,null,null,null,null,null,null,null,null,null,null,null,null,null,null,null,null,null,null,null,null,null,null,null,"Zapotitlán Palmas"]
[null,null,null,null,null,null,null,null,null,null,null,null,null,null,null,null,null,null,null,null,null,null,null,null,null,null,null,"Zimatlán de Álvarez"]

{"sheet":"Impactos","index":28,"n_rows":23,"n_cols":10,"rows_kept":23,"cut":false,"hidden":true,"merged":[]}
["ID","Nombre completo ","Nombre corto ","Grupo ","Definición","Referencia","Indicador","Sugerencias de indicador","Referencia","Comentarios"]
[1,"Prevención de inundaciones, regulación de escorrentías","Prevención de inundaciones, regulación de escorrentías","Adaptación","Potencial de reducir y/o ralentizar las escorrentías para evitar la saturación de los sistemas de drenaje y alcantarillado."]
[2,"Reducción de los riesgos derivados de las inundaciones, regulación de avenidas.","Reducción de los riesgos derivados de las inundaciones, regulación de avenidas.","Adaptación","Potencial de reducir y ralentizar las escorrentías para evitar inundaciones y el colapso de la infraestructura hidráulica y sanitaria y en consecuecia, daños materiales y pérdidas humanas"]
[3,"Incremento de la recarga de agua de los acuíferos","Incremento de la recarga de agua de los acuíferos","Adaptación","Potencial para inflitrar agua al subsuelo y evitar la subsidencia de los acuíferos y daño en la infraestructura urbana y en las edificaciones por hundimientos"]
[4,"Regulación térmica y disminución de las islas urbanas de calor","Regulación térmica y disminución de las islas urbanas de calor","Adaptación","Se refiere a contener el incremento de temperatura por efecto de la creación de sobreamientos por medios naturales (arbolado urbano) o humanos (lonas, toldos, pérgolas, etc.)"]
[5,"Mejora de la conectividad ecológica.","Mejora de la conectividad ecológica.","Adaptación","Se refiere a la capacidad de conexión de los ecosistemas similares en un paisaje fragmentado y que permite a las especies animales, vegetales e insectos, moverse, migrar, posarse, polinizar, alimentarse y reproducirse."]
[6,"Secuestro de carbono ","Secuestro de carbono ","Mitigación","La cantidad de carbono almacenado en la biomasa (hojas, tallos, tronco, raíces y materia orgánica del suelo). ","Nowak et al. (2008)"]
[7,"Reducción de emisiones de GEI","Reducción de emisiones de GEI","Mitigación","El potencial de reducir las emisiones de GEI","IPCC 2014"]
[8,"Mejora de la calidad del aire","Mejora de la calidad del aire","Ambiental","Se refiere a una disminución de los contaminantes del aire causados por la actividad humano: CO2, CO, NOx, PM10, PM2.5, etc."]
[9,"Mejora de la calidad del agua (purificación del agua)","Mejora de la calidad del agua (purificación del agua)","Ambiental","Se refiere a una disminución en los contaminantes del agua causdos por la actividad humana: Metales pesados, coliformes fecales…"]
[10,"Reducción de la contaminación por ruido","Reducción de la contaminación por ruido","Ambiental","Se refiere a la disminución en la intensidad del ruido a niveles permitidos por la normatividad (¿Cuántos desibeles?)"]
[11,"Control de la erosión del suelo","Control de la erosión del suelo","Ambiental","Se refiere a la capacidad para retener el suelo"]
[12,"Mantenimiento, protección y mejora de los hábitats naturales, la vida silvestre y la biodiversidad","Mantenimiento, protección y mejora de hábitats, vida silvestre y biodiversidad","Ambiental"]
[13,"Producción de servicios ecosistémicos","Producción de servicios ecosistémicos","Ambiental"]
[14,"Mejora de los valores estéticos","Mejora de los valores estéticos","Sociales"]
[15,"Mejora de accesibilidad de recursos para la práctica del deporte, el ocio, cultura, recreación y educación ","Mejora accesibilidad de recursos para deporte, cultura, formación y recreación","Sociales","Diversidad y número de personas que tienen la oportunidad de experimentar y disfrutar del entorno para diferntes actividades como resultado de las intervenciones urbanas ",null,"SI","(número de visitantes, número de actividades recreativas) o cultural (número de eventos culturales, personas involucradas, niños en actividades educativas)","Kabisch and Haase, 2014."]
[16,"Mejora de la salud y bienestar","Mejora de la salud y bienestar","Sociales"]
[17,"Generación de recursos comunitarios (fortalecimiento de la ciudadanía)","Generación de recursos comunitarios (fortalecimiento de la ciudadanía)","Sociales","Grado en el que la ciudades se percibe más allá del territorio físico e involucra a la personas en una construcción  conjunta\nque hace que la personas construyan ciudad y ciudadanía en el espacio público.","Guía Rápida de Urbanismo Táctico. Caso Piloto: Pereira. Asociación Colectivo Ciudadano Espacio & Ciudad. 12p"]
[18,"Fortalecimiento de sentimiento de pertenencia, identidad y humanización de las ciudades ","Fortalecimiento de sentimiento de pertenencia e identidad","Sociales","Grado de mejoría en la experiencia humana del espacio público"]
[19,"Optimización de la inversión pública al atender distintos objetivos e incentivar la coordinación entre actores clave","Optimización de la inversión pública ","Económicos","Grado de involucramiento de de actores externos :  actores sociales, comerciales, institucionales, accionistas, empresas públicas y privadas e instituciones financieras. "]
[20,"Atracción para negocios, turismo y economía verde","Atracción para negocios, turismo y economía verde","Económicos","Análisis de conexión de la IV con la red principal de transporte y con los negocios que fomentan la economia de proximidad y turismo sostenible.","https://www.aprendedeturismo.org/el-turismo-y-los-objetivos-de-desarrollo-sostenible-de-naciones-unidas/"]
[null,null,null,null,null,null,null,"Cycling may help to prevent 10 deaths in Mexico City per year due to the \nprotective benefits of increased physical activity."]
[null,null,null,null,null,null,null,"Total greenhouse gas emissions savings due to use of EcoBici instead of \nmotorised modes are nearly 1,190 tonnes per year, equivalent to almost 2.6 \nmillion miles driven by an average passenger vehicle.13"]